{"text_format":"3","workbook":"xlsx","n_sheets":8,"sheets":["General","POP","POS","KTP","KTO","POSKTO","RID","REPZEI"],"not_rendered":{"external_links":1,"defined_names":6},"read":"whole","date_system":"1900"}

{"sheet":"General","index":0,"n_rows":10,"n_cols":16036,"rows_kept":10}
["System:","IDLDB","Ersetzen durch Aliasnamen (System) der verwendeten Datenbank","Replace by the alias name (system) of the used database"]
["Sprache 1:","DEU","durch ungültigen Sprachschlüssel ersetzen, wenn keine deutschen Texte übernommen werden sollen","Replace by an invalid language key if German descriptions are not wanted",{"$nulls":1066},"durch ungültigen Sprachschlüssel ersetzen, wenn keine deutschen Texte übernommen werden sollen","Replace by an invalid language key if German descriptions are not wanted","Sprache 1:","DEU","durch ungültigen Sprachschlüssel ersetzen, wenn keine deutschen Texte übernommen werden sollen","Replace by an invalid language key if German descriptions are not wanted","Sprache 1:","DEU","durch ungültigen Sprachschlüssel ersetzen, wenn keine deutschen Texte übernommen werden sollen","Replace by an invalid language key if German descriptions are not wanted","Sprache 1:","DEU","durch ungültigen Sprachschlüssel ersetzen, wenn keine deutschen Texte übernommen werden sollen","Replace by an invalid language key if German descriptions are not wanted","Sprache 1:","DEU","durch ungültigen Sprachschlüssel ersetzen, wenn keine deutschen Texte übernommen werden sollen","Replace by an invalid language key if German descriptions are not wanted","Sprache 1:","DEU","durch ungültigen Sprachschlüssel ersetzen, wenn keine deutschen Texte übernommen werden sollen","Replace by an invalid language key if German descriptions are not wanted","Sprache 1:","DEU","durch ungültigen Sprachschlüssel ersetzen, wenn keine deutschen Texte übernommen werden sollen","Replace by an invalid language key if German descriptions are not wanted","Sprache 1:","DEU","durch ungültigen Sprachschlüssel ersetzen, wenn keine deutschen Texte übernommen werden sollen","Replace by an invalid language key if German descriptions are not wanted","Sprache 1:","DEU","durch ungültigen Sprachschlüssel ersetzen, wenn keine deutschen Texte übernommen werden sollen","Replace by an invalid language key if German descriptions are not wanted","Sprache 1:","DEU","durch ungültigen Sprachschlüssel ersetzen, wenn keine deutschen Texte übernommen werden sollen","Replace by an invalid language key if German descriptions are not wanted","Sprache 1:","DEU","durch ungültigen Sprachschlüssel ersetzen, wenn keine deutschen Texte übernommen werden sollen","Replace by an invalid language key if German descriptions are not wanted","Sprache 1:","DEU","durch ungültigen Sprachschlüssel ersetzen, wenn keine deutschen Texte übernommen werden sollen","Replace by an invalid language key if German descriptions are not wanted","Sprache 1:","DEU","durch ungültigen Sprachschlüssel ersetzen, wenn keine deutschen Texte übernommen werden sollen","Replace by an invalid language key if German descriptions are not wanted","Sprache 1:","DEU","durch ungültigen Sprachschlüssel ersetzen, wenn keine deutschen Texte übernommen werden sollen","Replace by an invalid language key if German descriptions are not wanted","Sprache 1:","DEU","durch ungültigen Sprachschlüssel ersetzen, wenn keine deutschen Texte übernommen werden sollen","Replace by an invalid language key if German descriptions are not wanted","Sprache 1:","DEU","durch ungültigen Sprachschlüssel ersetzen, wenn keine deutschen Texte übernommen werden sollen","Replace by an invalid language key if German descriptions are not wanted","Sprache 1:","DEU","durch ungültigen Sprachschlüssel ersetzen, wenn keine deutschen Texte übernommen werden sollen","Replace by an invalid language key if German descriptions are not wanted","Sprache 1:","DEU","durch ungültigen Sprachschlüssel ersetzen, wenn keine deutschen Texte übernommen werden sollen","Replace by an invalid language key if German descriptions are not wanted","Sprache 1:","DEU","durch ungültigen Sprachschlüssel ersetzen, wenn keine deutschen Texte übernommen werden sollen","Replace by an invalid language key if German descriptions are not wanted","Sprache 1:","DEU","durch ungültigen Sprachschlüssel ersetzen, wenn keine deutschen Texte übernommen werden sollen","Replace by an invalid language key if German descriptions are not wanted","Sprache 1:","DEU","durch ungültigen Sprachschlüssel ersetzen, wenn keine deutschen Texte übernommen werden sollen","Replace by an invalid language key if German descriptions are not wanted","Sprache 1:","DEU","durch ungültigen Sprachschlüssel ersetzen, wenn keine deutschen Texte übernommen werden sollen","Replace by an invalid language key if German descriptions are not wanted","Sprache 1:","DEU","durch ungültigen Sprachschlüssel ersetzen, wenn keine deutschen Texte übernommen werden sollen","Replace by an invalid language key if German descriptions are not wanted","Sprache 1:","DEU","durch ungültigen Sprachschlüssel ersetzen, wenn keine deutschen Texte übernommen werden sollen","Replace by an invalid language key if German descriptions are not wanted","Sprache 1:","DEU","durch ungültigen Sprachschlüssel ersetzen, wenn keine deutschen Texte übernommen werden sollen","Replace by an invalid language key if German descriptions are not wanted","Sprache 1:","DEU","durch ungültigen Sprachschlüssel ersetzen, wenn keine deutschen Texte übernommen werden sollen","Replace by an invalid language key if German descriptions are not wanted","Sprache 1:","DEU","durch ungültigen Sprachschlüssel ersetzen, wenn keine deutschen Texte übernommen werden sollen","Replace by an invalid language key if German descriptions are not wanted","Sprache 1:","DEU","durch ungültigen Sprachschlüssel ersetzen, wenn keine deutschen Texte übernommen werden sollen","Replace by an invalid language key if German descriptions are not wanted","Sprache 1:","DEU","durch ungültigen Sprachschlüssel ersetzen, wenn keine deutschen Texte übernommen werden sollen","Replace by an invalid language key if German descriptions are not wanted","Sprache 1:","DEU","durch ungültigen Sprachschlüssel ersetzen, wenn keine deutschen Texte übernommen werden sollen","Replace by an invalid language key if German descriptions are not wanted","Sprache 1:","DEU","durch ungültigen Sprachschlüssel ersetzen, wenn keine deutschen Texte übernommen werden sollen","Replace by an invalid language key if German descriptions are not wanted","Sprache 1:","DEU","durch ungültigen Sprachschlüssel ersetzen, wenn keine deutschen Texte übernommen werden sollen","Replace by an invalid language key if German descriptions are not wanted","Sprache 1:","DEU","durch ungültigen Sprachschlüssel ersetzen, wenn keine deutschen Texte übernommen werden sollen","Replace by an invalid language key if German descriptions are not wanted","Sprache 1:","DEU","durch ungültigen Sprachschlüssel ersetzen, wenn keine deutschen Texte übernommen werden sollen","Replace by an invalid language key if German descriptions are not wanted","Sprache 1:","DEU","durch ungültigen Sprachschlüssel ersetzen, wenn keine deutschen Texte übernommen werden sollen","Replace by an invalid language key if German descriptions are not wanted","Sprache 1:","DEU","durch ungültigen Sprachschlüssel ersetzen, wenn keine deutschen Texte übernommen werden sollen","Replace by an invalid language key if German descriptions are not wanted","Sprache 1:","DEU","durch ungültigen Sprachschlüssel ersetzen, wenn keine deutschen Texte übernommen werden sollen","Replace by an invalid language key if German descriptions are not wanted","Sprache 1:","DEU","durch ungültigen Sprachschlüssel ersetzen, wenn keine deutschen Texte übernommen werden sollen","Replace by an invalid language key if German descriptions are not wanted","Sprache 1:","DEU","durch ungültigen Sprachschlüssel ersetzen, wenn keine deutschen Texte übernommen werden sollen","Replace by an invalid language key if German descriptions are not wanted","Sprache 1:","DEU","durch ungültigen Sprachschlüssel ersetzen, wenn keine deutschen Texte übernommen werden sollen","Replace by an invalid language key if German descriptions are not wanted","Sprache 1:","DEU","durch ungültigen Sprachschlüssel ersetzen, wenn keine deutschen Texte übernommen werden sollen","Replace by an invalid language key if German descriptions are not wanted","Sprache 1:","DEU","durch ungültigen Sprachschlüssel ersetzen, wenn keine deutschen Texte übernommen werden sollen","Replace by an invalid language key if German descriptions are not wanted","Sprache 1:","DEU","durch ungültigen Sprachschlüssel ersetzen, wenn keine deutschen Texte übernommen werden sollen","Replace by an invalid language key if German descriptions are not wanted","Sprache 1:","DEU","durch ungültigen Sprachschlüssel ersetzen, wenn keine deutschen Texte übernommen werden sollen","Replace by an invalid language key if German descriptions are not wanted","Sprache 1:","DEU","durch ungültigen Sprachschlüssel ersetzen, wenn keine deutschen Texte übernommen werden sollen","Replace by an invalid language key if German descriptions are not wanted","Sprache 1:","DEU","durch ungültigen Sprachschlüssel ersetzen, wenn keine deutschen Texte übernommen werden sollen","Replace by an invalid language key if German descriptions are not wanted","Sprache 1:","DEU","durch ungültigen Sprachschlüssel ersetzen, wenn keine deutschen Texte übernommen werden sollen","Replace by an invalid language key if German descriptions are not wanted","Sprache 1:","DEU","durch ungültigen Sprachschlüssel ersetzen, wenn keine deutschen Texte übernommen werden sollen","Replace by an invalid language key if German descriptions are not wanted","Sprache 1:","DEU","durch ungültigen Sprachschlüssel ersetzen, wenn keine deutschen Texte übernommen werden sollen","Replace by an invalid language key if German descriptions are not wanted","Sprache 1:","DEU","durch ungültigen Sprachschlüssel ersetzen, wenn keine deutschen Texte übernommen werden sollen","Replace by an invalid language key if German descriptions are not wanted","Sprache 1:","DEU","durch ungültigen Sprachschlüssel ersetzen, wenn keine deutschen Texte übernommen werden sollen","Replace by an invalid language key if German descriptions are not wanted","Sprache 1:","DEU","durch ungültigen Sprachschlüssel ersetzen, wenn keine deutschen Texte übernommen werden sollen","Replace by an invalid language key if German descriptions are not wanted","Sprache 1:","DEU","durch ungültigen Sprachschlüssel ersetzen, wenn keine deutschen Texte übernommen werden sollen","Replace by an invalid language key if German descriptions are not wanted","Sprache 1:","DEU","durch ungültigen Sprachschlüssel ersetzen, wenn keine deutschen Texte übernommen werden sollen","Replace by an invalid language key if German descriptions are not wanted","Sprache 1:","DEU","durch ungültigen Sprachschlüssel ersetzen, wenn keine deutschen Texte übernommen werden sollen","Replace by an invalid language key if German descriptions are not wanted","Sprache 1:","DEU","durch ungültigen Sprachschlüssel ersetzen, wenn keine deutschen Texte übernommen werden sollen","Replace by an invalid language key if German descriptions are not wanted","Sprache 1:","DEU","durch ungültigen Sprachschlüssel ersetzen, wenn keine deutschen Texte übernommen werden sollen","Replace by an invalid language key if German descriptions are not wanted","Sprache 1:","DEU","durch ungültigen Sprachschlüssel ersetzen, wenn keine deutschen Texte übernommen werden sollen","Replace by an invalid language key if German descriptions are not wanted","Sprache 1:","DEU","durch ungültigen Sprachschlüssel ersetzen, wenn keine deutschen Texte übernommen werden sollen","Replace by an invalid language key if German descriptions are not wanted","Sprache 1:","DEU","durch ungültigen Sprachschlüssel ersetzen, wenn keine deutschen Texte übernommen werden sollen","Replace by an invalid language key if German descriptions are not wanted","Sprache 1:","DEU","durch ungültigen Sprachschlüssel ersetzen, wenn keine deutschen Texte übernommen werden sollen","Replace by an invalid language key if German descriptions are not wanted","Sprache 1:","DEU","durch ungültigen Sprachschlüssel ersetzen, wenn keine deutschen Texte übernommen werden sollen","Replace by an invalid language key if German descriptions are not wanted","Sprache 1:","DEU","durch ungültigen Sprachschlüssel ersetzen, wenn keine deutschen Texte übernommen werden sollen","Replace by an invalid language key if German descriptions are not wanted","Sprache 1:","DEU","durch ungültigen Sprachschlüssel ersetzen, wenn keine deutschen Texte übernommen werden sollen","Replace by an invalid language key if German descriptions are not wanted","Sprache 1:","DEU","durch ungültigen Sprachschlüssel ersetzen, wenn keine deutschen Texte übernommen werden sollen","Replace by an invalid language key if German descriptions are not wanted","Sprache 1:","DEU","durch ungültigen Sprachschlüssel ersetzen, wenn keine deutschen Texte übernommen werden sollen","Replace by an invalid language key if German descriptions are not wanted","Sprache 1:","DEU","durch ungültigen Sprachschlüssel ersetzen, wenn keine deutschen Texte übernommen werden sollen","Replace by an invalid language key if German descriptions are not wanted","Sprache 1:","DEU","durch ungültigen Sprachschlüssel ersetzen, wenn keine deutschen Texte übernommen werden sollen","Replace by an invalid language key if German descriptions are not wanted","Sprache 1:","DEU","durch ungültigen Sprachschlüssel ersetzen, wenn keine deutschen Texte übernommen werden sollen","Replace by an invalid language key if German descriptions are not wanted","Sprache 1:","DEU","durch ungültigen Sprachschlüssel ersetzen, wenn keine deutschen Texte übernommen werden sollen","Replace by an invalid language key if German descriptions are not wanted","Sprache 1:","DEU","durch ungültigen Sprachschlüssel ersetzen, wenn keine deutschen Texte übernommen werden sollen","Replace by an invalid language key if German descriptions are not wanted","Sprache 1:","DEU","durch ungültigen Sprachschlüssel ersetzen, wenn keine deutschen Texte übernommen werden sollen","Replace by an invalid language key if German descriptions are not wanted","Sprache 1:","DEU","durch ungültigen Sprachschlüssel ersetzen, wenn keine deutschen Texte übernommen werden sollen","Replace by an invalid language key if German descriptions are not wanted","Sprache 1:","DEU","durch ungültigen Sprachschlüssel ersetzen, wenn keine deutschen Texte übernommen werden sollen","Replace by an invalid language key if German descriptions are not wanted","Sprache 1:","DEU","durch ungültigen Sprachschlüssel ersetzen, wenn keine deutschen Texte übernommen werden sollen","Replace by an invalid language key if German descriptions are not wanted","Sprache 1:","DEU","durch ungültigen Sprachschlüssel ersetzen, wenn keine deutschen Texte übernommen werden sollen","Replace by an invalid language key if German descriptions are not wanted","Sprache 1:","DEU","durch ungültigen Sprachschlüssel ersetzen, wenn keine deutschen Texte übernommen werden sollen","Replace by an invalid language key if German descriptions are not wanted","Sprache 1:","DEU","durch ungültigen Sprachschlüssel ersetzen, wenn keine deutschen Texte übernommen werden sollen","Replace by an invalid language key if German descriptions are not wanted","Sprache 1:","DEU","durch ungültigen Sprachschlüssel ersetzen, wenn keine deutschen Texte übernommen werden sollen","Replace by an invalid language key if German descriptions are not wanted","Sprache 1:","DEU","durch ungültigen Sprachschlüssel ersetzen, wenn keine deutschen Texte übernommen werden sollen","Replace by an invalid language key if German descriptions are not wanted","Sprache 1:","DEU","durch ungültigen Sprachschlüssel ersetzen, wenn keine deutschen Texte übernommen werden sollen","Replace by an invalid language key if German descriptions are not wanted","Sprache 1:","DEU","durch ungültigen Sprachschlüssel ersetzen, wenn keine deutschen Texte übernommen werden sollen","Replace by an invalid language key if German descriptions are not wanted","Sprache 1:","DEU","durch ungültigen Sprachschlüssel ersetzen, wenn keine deutschen Texte übernommen werden sollen","Replace by an invalid language key if German descriptions are not wanted","Sprache 1:","DEU","durch ungültigen Sprachschlüssel ersetzen, wenn keine deutschen Texte übernommen werden sollen","Replace by an invalid language key if German descriptions are not wanted","Sprache 1:","DEU","durch ungültigen Sprachschlüssel ersetzen, wenn keine deutschen Texte übernommen werden sollen","Replace by an invalid language key if German descriptions are not wanted","Sprache 1:","DEU","durch ungültigen Sprachschlüssel ersetzen, wenn keine deutschen Texte übernommen werden sollen","Replace by an invalid language key if German descriptions are not wanted","Sprache 1:","DEU","durch ungültigen Sprachschlüssel ersetzen, wenn keine deutschen Texte übernommen werden sollen","Replace by an invalid language key if German descriptions are not wanted","Sprache 1:","DEU","durch ungültigen Sprachschlüssel ersetzen, wenn keine deutschen Texte übernommen werden sollen","Replace by an invalid language key if German descriptions are not wanted","Sprache 1:","DEU","durch ungültigen Sprachschlüssel ersetzen, wenn keine deutschen Texte übernommen werden sollen","Replace by an invalid language key if German descriptions are not wanted","Sprache 1:","DEU","durch ungültigen Sprachschlüssel ersetzen, wenn keine deutschen Texte übernommen werden sollen","Replace by an invalid language key if German descriptions are not wanted","Sprache 1:","DEU","durch ungültigen Sprachschlüssel ersetzen, wenn keine deutschen Texte übernommen werden sollen","Replace by an invalid language key if German descriptions are not wanted","Sprache 1:","DEU","durch ungültigen Sprachschlüssel ersetzen, wenn keine deutschen Texte übernommen werden sollen","Replace by an invalid language key if German descriptions are not wanted","Sprache 1:","DEU","durch ungültigen Sprachschlüssel ersetzen, wenn keine deutschen Texte übernommen werden sollen","Replace by an invalid language key if German descriptions are not wanted","Sprache 1:","DEU","durch ungültigen Sprachschlüssel ersetzen, wenn keine deutschen Texte übernommen werden sollen","Replace by an invalid language key if German descriptions are not wanted","Sprache 1:","DEU","durch ungültigen Sprachschlüssel ersetzen, wenn keine deutschen Texte übernommen werden sollen","Replace by an invalid language key if German descriptions are not wanted","Sprache 1:","DEU","durch ungültigen Sprachschlüssel ersetzen, wenn keine deutschen Texte übernommen werden sollen","Replace by an invalid language key if German descriptions are not wanted","Sprache 1:","DEU","durch ungültigen Sprachschlüssel ersetzen, wenn keine deutschen Texte übernommen werden sollen","Replace by an invalid language key if German descriptions are not wanted","Sprache 1:","DEU","durch ungültigen Sprachschlüssel ersetzen, wenn keine deutschen Texte übernommen werden sollen","Replace by an invalid language key if German descriptions are not wanted","Sprache 1:","DEU","durch ungültigen Sprachschlüssel ersetzen, wenn keine deutschen Texte übernommen werden sollen","Replace by an invalid language key if German descriptions are not wanted","Sprache 1:","DEU","durch ungültigen Sprachschlüssel ersetzen, wenn keine deutschen Texte übernommen werden sollen","Replace by an invalid language key if German descriptions are not wanted","Sprache 1:","DEU","durch ungültigen Sprachschlüssel ersetzen, wenn keine deutschen Texte übernommen werden sollen","Replace by an invalid language key if German descriptions are not wanted","Sprache 1:","DEU","durch ungültigen Sprachschlüssel ersetzen, wenn keine deutschen Texte übernommen werden sollen","Replace by an invalid language key if German descriptions are not wanted","Sprache 1:","DEU","durch ungültigen Sprachschlüssel ersetzen, wenn keine deutschen Texte übernommen werden sollen","Replace by an invalid language key if German descriptions are not wanted","Sprache 1:","DEU","durch ungültigen Sprachschlüssel ersetzen, wenn keine deutschen Texte übernommen werden sollen","Replace by an invalid language key if German descriptions are not wanted","Sprache 1:","DEU","durch ungültigen Sprachschlüssel ersetzen, wenn keine deutschen Texte übernommen werden sollen","Replace by an invalid language key if German descriptions are not wanted","Sprache 1:","DEU","durch ungültigen Sprachschlüssel ersetzen, wenn keine deutschen Texte übernommen werden sollen","Replace by an invalid language key if German descriptions are not wanted","Sprache 1:","DEU","durch ungültigen Sprachschlüssel ersetzen, wenn keine deutschen Texte übernommen werden sollen","Replace by an invalid language key if German descriptions are not wanted","Sprache 1:","DEU","durch ungültigen Sprachschlüssel ersetzen, wenn keine deutschen Texte übernommen werden sollen","Replace by an invalid language key if German descriptions are not wanted","Sprache 1:","DEU","durch ungültigen Sprachschlüssel ersetzen, wenn keine deutschen Texte übernommen werden sollen","Replace by an invalid language key if German descriptions are not wanted","Sprache 1:","DEU","durch ungültigen Sprachschlüssel ersetzen, wenn keine deutschen Texte übernommen werden sollen","Replace by an invalid language key if German descriptions are not wanted","Sprache 1:","DEU","durch ungültigen Sprachschlüssel ersetzen, wenn keine deutschen Texte übernommen werden sollen","Replace by an invalid language key if German descriptions are not wanted","Sprache 1:","DEU","durch ungültigen Sprachschlüssel ersetzen, wenn keine deutschen Texte übernommen werden sollen","Replace by an invalid language key if German descriptions are not wanted","Sprache 1:","DEU","durch ungültigen Sprachschlüssel ersetzen, wenn keine deutschen Texte übernommen werden sollen","Replace by an invalid language key if German descriptions are not wanted","Sprache 1:","DEU","durch ungültigen Sprachschlüssel ersetzen, wenn keine deutschen Texte übernommen werden sollen","Replace by an invalid language key if German descriptions are not wanted","Sprache 1:","DEU","durch ungültigen Sprachschlüssel ersetzen, wenn keine deutschen Texte übernommen werden sollen","Replace by an invalid language key if German descriptions are not wanted","Sprache 1:","DEU","durch ungültigen Sprachschlüssel ersetzen, wenn keine deutschen Texte übernommen werden sollen","Replace by an invalid language key if German descriptions are not wanted","Sprache 1:","DEU","durch ungültigen Sprachschlüssel ersetzen, wenn keine deutschen Texte übernommen werden sollen","Replace by an invalid language key if German descriptions are not wanted","Sprache 1:","DEU","durch ungültigen Sprachschlüssel ersetzen, wenn keine deutschen Texte übernommen werden sollen","Replace by an invalid language key if German descriptions are not wanted","Sprache 1:","DEU","durch ungültigen Sprachschlüssel ersetzen, wenn keine deutschen Texte übernommen werden sollen","Replace by an invalid language key if German descriptions are not wanted","Sprache 1:","DEU","durch ungültigen Sprachschlüssel ersetzen, wenn keine deutschen Texte übernommen werden sollen","Replace by an invalid language key if German descriptions are not wanted","Sprache 1:","DEU","durch ungültigen Sprachschlüssel ersetzen, wenn keine deutschen Texte übernommen werden sollen","Replace by an invalid language key if German descriptions are not wanted","Sprache 1:","DEU","durch ungültigen Sprachschlüssel ersetzen, wenn keine deutschen Texte übernommen werden sollen","Replace by an invalid language key if German descriptions are not wanted","Sprache 1:","DEU","durch ungültigen Sprachschlüssel ersetzen, wenn keine deutschen Texte übernommen werden sollen","Replace by an invalid language key if German descriptions are not wanted","Sprache 1:","DEU","durch ungültigen Sprachschlüssel ersetzen, wenn keine deutschen Texte übernommen werden sollen","Replace by an invalid language key if German descriptions are not wanted","Sprache 1:","DEU","durch ungültigen Sprachschlüssel ersetzen, wenn keine deutschen Texte übernommen werden sollen","Replace by an invalid language key if German descriptions are not wanted","Sprache 1:","DEU","durch ungültigen Sprachschlüssel ersetzen, wenn keine deutschen Texte übernommen werden sollen","Replace by an invalid language key if German descriptions are not wanted","Sprache 1:","DEU","durch ungültigen Sprachschlüssel ersetzen, wenn keine deutschen Texte übernommen werden sollen","Replace by an invalid language key if German descriptions are not wanted","Sprache 1:","DEU","durch ungültigen Sprachschlüssel ersetzen, wenn keine deutschen Texte übernommen werden sollen","Replace by an invalid language key if German descriptions are not wanted","Sprache 1:","DEU","durch ungültigen Sprachschlüssel ersetzen, wenn keine deutschen Texte übernommen werden sollen","Replace by an invalid language key if German descriptions are not wanted","Sprache 1:","DEU","durch ungültigen Sprachschlüssel ersetzen, wenn keine deutschen Texte übernommen werden sollen","Replace by an invalid language key if German descriptions are not wanted","Sprache 1:","DEU","durch ungültigen Sprachschlüssel ersetzen, wenn keine deutschen Texte übernommen werden sollen","Replace by an invalid language key if German descriptions are not wanted","Sprache 1:","DEU","durch ungültigen Sprachschlüssel ersetzen, wenn keine deutschen Texte übernommen werden sollen","Replace by an invalid language key if German descriptions are not wanted","Sprache 1:","DEU","durch ungültigen Sprachschlüssel ersetzen, wenn keine deutschen Texte übernommen werden sollen","Replace by an invalid language key if German descriptions are not wanted","Sprache 1:","DEU","durch ungültigen Sprachschlüssel ersetzen, wenn keine deutschen Texte übernommen werden sollen","Replace by an invalid language key if German descriptions are not wanted","Sprache 1:","DEU","durch ungültigen Sprachschlüssel ersetzen, wenn keine deutschen Texte übernommen werden sollen","Replace by an invalid language key if German descriptions are not wanted","Sprache 1:","DEU","durch ungültigen Sprachschlüssel ersetzen, wenn keine deutschen Texte übernommen werden sollen","Replace by an invalid language key if German descriptions are not wanted","Sprache 1:","DEU","durch ungültigen Sprachschlüssel ersetzen, wenn keine deutschen Texte übernommen werden sollen","Replace by an invalid language key if German descriptions are not wanted","Sprache 1:","DEU","durch ungültigen Sprachschlüssel ersetzen, wenn keine deutschen Texte übernommen werden sollen","Replace by an invalid language key if German descriptions are not wanted","Sprache 1:","DEU","durch ungültigen Sprachschlüssel ersetzen, wenn keine deutschen Texte übernommen werden sollen","Replace by an invalid language key if German descriptions are not wanted","Sprache 1:","DEU","durch ungültigen Sprachschlüssel ersetzen, wenn keine deutschen Texte übernommen werden sollen","Replace by an invalid language key if German descriptions are not wanted","Sprache 1:","DEU","durch ungültigen Sprachschlüssel ersetzen, wenn keine deutschen Texte übernommen werden sollen","Replace by an invalid language key if German descriptions are not wanted","Sprache 1:","DEU","durch ungültigen Sprachschlüssel ersetzen, wenn keine deutschen Texte übernommen werden sollen","Replace by an invalid language key if German descriptions are not wanted","Sprache 1:","DEU","durch ungültigen Sprachschlüssel ersetzen, wenn keine deutschen Texte übernommen werden sollen","Replace by an invalid language key if German descriptions are not wanted","Sprache 1:","DEU","durch ungültigen Sprachschlüssel ersetzen, wenn keine deutschen Texte übernommen werden sollen","Replace by an invalid language key if German descriptions are not wanted","Sprache 1:","DEU","durch ungültigen Sprachschlüssel ersetzen, wenn keine deutschen Texte übernommen werden sollen","Replace by an invalid language key if German descriptions are not wanted","Sprache 1:","DEU","durch ungültigen Sprachschlüssel ersetzen, wenn keine deutschen Texte übernommen werden sollen","Replace by an invalid language key if German descriptions are not wanted","Sprache 1:","DEU","durch ungültigen Sprachschlüssel ersetzen, wenn keine deutschen Texte übernommen werden sollen","Replace by an invalid language key if German descriptions are not wanted","Sprache 1:","DEU","durch ungültigen Sprachschlüssel ersetzen, wenn keine deutschen Texte übernommen werden sollen","Replace by an invalid language key if German descriptions are not wanted","Sprache 1:","DEU","durch ungültigen Sprachschlüssel ersetzen, wenn keine deutschen Texte übernommen werden sollen","Replace by an invalid language key if German descriptions are not wanted","Sprache 1:","DEU","durch ungültigen Sprachschlüssel ersetzen, wenn keine deutschen Texte übernommen werden sollen","Replace by an invalid language key if German descriptions are not wanted","Sprache 1:","DEU","durch ungültigen Sprachschlüssel ersetzen, wenn keine deutschen Texte übernommen werden sollen","Replace by an invalid language key if German descriptions are not wanted","Sprache 1:","DEU","durch ungültigen Sprachschlüssel ersetzen, wenn keine deutschen Texte übernommen werden sollen","Replace by an invalid language key if German descriptions are not wanted","Sprache 1:","DEU","durch ungültigen Sprachschlüssel ersetzen, wenn keine deutschen Texte übernommen werden sollen","Replace by an invalid language key if German descriptions are not wanted","Sprache 1:","DEU","durch ungültigen Sprachschlüssel ersetzen, wenn keine deutschen Texte übernommen werden sollen","Replace by an invalid language key if German descriptions are not wanted","Sprache 1:","DEU","durch ungültigen Sprachschlüssel ersetzen, wenn keine deutschen Texte übernommen werden sollen","Replace by an invalid language key if German descriptions are not wanted","Sprache 1:","DEU","durch ungültigen Sprachschlüssel ersetzen, wenn keine deutschen Texte übernommen werden sollen","Replace by an invalid language key if German descriptions are not wanted","Sprache 1:","DEU","durch ungültigen Sprachschlüssel ersetzen, wenn keine deutschen Texte übernommen werden sollen","Replace by an invalid language key if German descriptions are not wanted","Sprache 1:","DEU","durch ungültigen Sprachschlüssel ersetzen, wenn keine deutschen Texte übernommen werden sollen","Replace by an invalid language key if German descriptions are not wanted","Sprache 1:","DEU","durch ungültigen Sprachschlüssel ersetzen, wenn keine deutschen Texte übernommen werden sollen","Replace by an invalid language key if German descriptions are not wanted","Sprache 1:","DEU","durch ungültigen Sprachschlüssel ersetzen, wenn keine deutschen Texte übernommen werden sollen","Replace by an invalid language key if German descriptions are not wanted","Sprache 1:","DEU","durch ungültigen Sprachschlüssel ersetzen, wenn keine deutschen Texte übernommen werden sollen","Replace by an invalid language key if German descriptions are not wanted","Sprache 1:","DEU","durch ungültigen Sprachschlüssel ersetzen, wenn keine deutschen Texte übernommen werden sollen","Replace by an invalid language key if German descriptions are not wanted","Sprache 1:","DEU","durch ungültigen Sprachschlüssel ersetzen, wenn keine deutschen Texte übernommen werden sollen","Replace by an invalid language key if German descriptions are not wanted","Sprache 1:","DEU","durch ungültigen Sprachschlüssel ersetzen, wenn keine deutschen Texte übernommen werden sollen","Replace by an invalid language key if German descriptions are not wanted","Sprache 1:","DEU","durch ungültigen Sprachschlüssel ersetzen, wenn keine deutschen Texte übernommen werden sollen","Replace by an invalid language key if German descriptions are not wanted","Sprache 1:","DEU","durch ungültigen Sprachschlüssel ersetzen, wenn keine deutschen Texte übernommen werden sollen","Replace by an invalid language key if German descriptions are not wanted","Sprache 1:","DEU","durch ungültigen Sprachschlüssel ersetzen, wenn keine deutschen Texte übernommen werden sollen","Replace by an invalid language key if German descriptions are not wanted","Sprache 1:","DEU","durch ungültigen Sprachschlüssel ersetzen, wenn keine deutschen Texte übernommen werden sollen","Replace by an invalid language key if German descriptions are not wanted","Sprache 1:","DEU","durch ungültigen Sprachschlüssel ersetzen, wenn keine deutschen Texte übernommen werden sollen","Replace by an invalid language key if German descriptions are not wanted","Sprache 1:","DEU","durch ungültigen Sprachschlüssel ersetzen, wenn keine deutschen Texte übernommen werden sollen","Replace by an invalid language key if German descriptions are not wanted","Sprache 1:","DEU","durch ungültigen Sprachschlüssel ersetzen, wenn keine deutschen Texte übernommen werden sollen","Replace by an invalid language key if German descriptions are not wanted","Sprache 1:","DEU","durch ungültigen Sprachschlüssel ersetzen, wenn keine deutschen Texte übernommen werden sollen","Replace by an invalid language key if German descriptions are not wanted","Sprache 1:","DEU","durch ungültigen Sprachschlüssel ersetzen, wenn keine deutschen Texte übernommen werden sollen","Replace by an invalid language key if German descriptions are not wanted","Sprache 1:","DEU","durch ungültigen Sprachschlüssel ersetzen, wenn keine deutschen Texte übernommen werden sollen","Replace by an invalid language key if German descriptions are not wanted","Sprache 1:","DEU","durch ungültigen Sprachschlüssel ersetzen, wenn keine deutschen Texte übernommen werden sollen","Replace by an invalid language key if German descriptions are not wanted","Sprache 1:","DEU","durch ungültigen Sprachschlüssel ersetzen, wenn keine deutschen Texte übernommen werden sollen","Replace by an invalid language key if German descriptions are not wanted","Sprache 1:","DEU","durch ungültigen Sprachschlüssel ersetzen, wenn keine deutschen Texte übernommen werden sollen","Replace by an invalid language key if German descriptions are not wanted","Sprache 1:","DEU","durch ungültigen Sprachschlüssel ersetzen, wenn keine deutschen Texte übernommen werden sollen","Replace by an invalid language key if German descriptions are not wanted","Sprache 1:","DEU","durch ungültigen Sprachschlüssel ersetzen, wenn keine deutschen Texte übernommen werden sollen","Replace by an invalid language key if German descriptions are not wanted","Sprache 1:","DEU","durch ungültigen Sprachschlüssel ersetzen, wenn keine deutschen Texte übernommen werden sollen","Replace by an invalid language key if German descriptions are not wanted","Sprache 1:","DEU","durch ungültigen Sprachschlüssel ersetzen, wenn keine deutschen Texte übernommen werden sollen","Replace by an invalid language key if German descriptions are not wanted","Sprache 1:","DEU","durch ungültigen Sprachschlüssel ersetzen, wenn keine deutschen Texte übernommen werden sollen","Replace by an invalid language key if German descriptions are not wanted","Sprache 1:","DEU","durch ungültigen Sprachschlüssel ersetzen, wenn keine deutschen Texte übernommen werden sollen","Replace by an invalid language key if German descriptions are not wanted","Sprache 1:","DEU","durch ungültigen Sprachschlüssel ersetzen, wenn keine deutschen Texte übernommen werden sollen","Replace by an invalid language key if German descriptions are not wanted","Sprache 1:","DEU","durch ungültigen Sprachschlüssel ersetzen, wenn keine deutschen Texte übernommen werden sollen","Replace by an invalid language key if German descriptions are not wanted","Sprache 1:","DEU","durch ungültigen Sprachschlüssel ersetzen, wenn keine deutschen Texte übernommen werden sollen","Replace by an invalid language key if German descriptions are not wanted","Sprache 1:","DEU","durch ungültigen Sprachschlüssel ersetzen, wenn keine deutschen Texte übernommen werden sollen","Replace by an invalid language key if German descriptions are not wanted","Sprache 1:","DEU","durch ungültigen Sprachschlüssel ersetzen, wenn keine deutschen Texte übernommen werden sollen","Replace by an invalid language key if German descriptions are not wanted","Sprache 1:","DEU","durch ungültigen Sprachschlüssel ersetzen, wenn keine deutschen Texte übernommen werden sollen","Replace by an invalid language key if German descriptions are not wanted","Sprache 1:","DEU","durch ungültigen Sprachschlüssel ersetzen, wenn keine deutschen Texte übernommen werden sollen","Replace by an invalid language key if German descriptions are not wanted","Sprache 1:","DEU","durch ungültigen Sprachschlüssel ersetzen, wenn keine deutschen Texte übernommen werden sollen","Replace by an invalid language key if German descriptions are not wanted","Sprache 1:","DEU","durch ungültigen Sprachschlüssel ersetzen, wenn keine deutschen Texte übernommen werden sollen","Replace by an invalid language key if German descriptions are not wanted","Sprache 1:","DEU","durch ungültigen Sprachschlüssel ersetzen, wenn keine deutschen Texte übernommen werden sollen","Replace by an invalid language key if German descriptions are not wanted","Sprache 1:","DEU","durch ungültigen Sprachschlüssel ersetzen, wenn keine deutschen Texte übernommen werden sollen","Replace by an invalid language key if German descriptions are not wanted","Sprache 1:","DEU","durch ungültigen Sprachschlüssel ersetzen, wenn keine deutschen Texte übernommen werden sollen","Replace by an invalid language key if German descriptions are not wanted","Sprache 1:","DEU","durch ungültigen Sprachschlüssel ersetzen, wenn keine deutschen Texte übernommen werden sollen","Replace by an invalid language key if German descriptions are not wanted","Sprache 1:","DEU","durch ungültigen Sprachschlüssel ersetzen, wenn keine deutschen Texte übernommen werden sollen","Replace by an invalid language key if German descriptions are not wanted","Sprache 1:","DEU","durch ungültigen Sprachschlüssel ersetzen, wenn keine deutschen Texte übernommen werden sollen","Replace by an invalid language key if German descriptions are not wanted","Sprache 1:","DEU","durch ungültigen Sprachschlüssel ersetzen, wenn keine deutschen Texte übernommen werden sollen","Replace by an invalid language key if German descriptions are not wanted","Sprache 1:","DEU","durch ungültigen Sprachschlüssel ersetzen, wenn keine deutschen Texte übernommen werden sollen","Replace by an invalid language key if German descriptions are not wanted","Sprache 1:","DEU","durch ungültigen Sprachschlüssel ersetzen, wenn keine deutschen Texte übernommen werden sollen","Replace by an invalid language key if German descriptions are not wanted","Sprache 1:","DEU","durch ungültigen Sprachschlüssel ersetzen, wenn keine deutschen Texte übernommen werden sollen","Replace by an invalid language key if German descriptions are not wanted","Sprache 1:","DEU","durch ungültigen Sprachschlüssel ersetzen, wenn keine deutschen Texte übernommen werden sollen","Replace by an invalid language key if German descriptions are not wanted","Sprache 1:","DEU","durch ungültigen Sprachschlüssel ersetzen, wenn keine deutschen Texte übernommen werden sollen","Replace by an invalid language key if German descriptions are not wanted","Sprache 1:","DEU","durch ungültigen Sprachschlüssel ersetzen, wenn keine deutschen Texte übernommen werden sollen","Replace by an invalid language key if German descriptions are not wanted","Sprache 1:","DEU","durch ungültigen Sprachschlüssel ersetzen, wenn keine deutschen Texte übernommen werden sollen","Replace by an invalid language key if German descriptions are not wanted","Sprache 1:","DEU","durch ungültigen Sprachschlüssel ersetzen, wenn keine deutschen Texte übernommen werden sollen","Replace by an invalid language key if German descriptions are not wanted","Sprache 1:","DEU","durch ungültigen Sprachschlüssel ersetzen, wenn keine deutschen Texte übernommen werden sollen","Replace by an invalid language key if German descriptions are not wanted","Sprache 1:","DEU","durch ungültigen Sprachschlüssel ersetzen, wenn keine deutschen Texte übernommen werden sollen","Replace by an invalid language key if German descriptions are not wanted","Sprache 1:","DEU","durch ungültigen Sprachschlüssel ersetzen, wenn keine deutschen Texte übernommen werden sollen","Replace by an invalid language key if German descriptions are not wanted","Sprache 1:","DEU","durch ungültigen Sprachschlüssel ersetzen, wenn keine deutschen Texte übernommen werden sollen","Replace by an invalid language key if German descriptions are not wanted","Sprache 1:","DEU","durch ungültigen Sprachschlüssel ersetzen, wenn keine deutschen Texte übernommen werden sollen","Replace by an invalid language key if German descriptions are not wanted","Sprache 1:","DEU","durch ungültigen Sprachschlüssel ersetzen, wenn keine deutschen Texte übernommen werden sollen","Replace by an invalid language key if German descriptions are not wanted","Sprache 1:","DEU","durch ungültigen Sprachschlüssel ersetzen, wenn keine deutschen Texte übernommen werden sollen","Replace by an invalid language key if German descriptions are not wanted","Sprache 1:","DEU","durch ungültigen Sprachschlüssel ersetzen, wenn keine deutschen Texte übernommen werden sollen","Replace by an invalid language key if German descriptions are not wanted","Sprache 1:","DEU","durch ungültigen Sprachschlüssel ersetzen, wenn keine deutschen Texte übernommen werden sollen","Replace by an invalid language key if German descriptions are not wanted","Sprache 1:","DEU","durch ungültigen Sprachschlüssel ersetzen, wenn keine deutschen Texte übernommen werden sollen","Replace by an invalid language key if German descriptions are not wanted","Sprache 1:","DEU","durch ungültigen Sprachschlüssel ersetzen, wenn keine deutschen Texte übernommen werden sollen","Replace by an invalid language key if German descriptions are not wanted","Sprache 1:","DEU","durch ungültigen Sprachschlüssel ersetzen, wenn keine deutschen Texte übernommen werden sollen","Replace by an invalid language key if German descriptions are not wanted","Sprache 1:","DEU","durch ungültigen Sprachschlüssel ersetzen, wenn keine deutschen Texte übernommen werden sollen","Replace by an invalid language key if German descriptions are not wanted","Sprache 1:","DEU","durch ungültigen Sprachschlüssel ersetzen, wenn keine deutschen Texte übernommen werden sollen","Replace by an invalid language key if German descriptions are not wanted","Sprache 1:","DEU","durch ungültigen Sprachschlüssel ersetzen, wenn keine deutschen Texte übernommen werden sollen","Replace by an invalid language key if German descriptions are not wanted","Sprache 1:","DEU","durch ungültigen Sprachschlüssel ersetzen, wenn keine deutschen Texte übernommen werden sollen","Replace by an invalid language key if German descriptions are not wanted","Sprache 1:","DEU","durch ungültigen Sprachschlüssel ersetzen, wenn keine deutschen Texte übernommen werden sollen","Replace by an invalid language key if German descriptions are not wanted","Sprache 1:","DEU","durch ungültigen Sprachschlüssel ersetzen, wenn keine deutschen Texte übernommen werden sollen","Replace by an invalid language key if German descriptions are not wanted","Sprache 1:","DEU","durch ungültigen Sprachschlüssel ersetzen, wenn keine deutschen Texte übernommen werden sollen","Replace by an invalid language key if German descriptions are not wanted","Sprache 1:","DEU","durch ungültigen Sprachschlüssel ersetzen, wenn keine deutschen Texte übernommen werden sollen","Replace by an invalid language key if German descriptions are not wanted","Sprache 1:","DEU","durch ungültigen Sprachschlüssel ersetzen, wenn keine deutschen Texte übernommen werden sollen","Replace by an invalid language key if German descriptions are not wanted","Sprache 1:","DEU","durch ungültigen Sprachschlüssel ersetzen, wenn keine deutschen Texte übernommen werden sollen","Replace by an invalid language key if German descriptions are not wanted","Sprache 1:","DEU","durch ungültigen Sprachschlüssel ersetzen, wenn keine deutschen Texte übernommen werden sollen","Replace by an invalid language key if German descriptions are not wanted","Sprache 1:","DEU","durch ungültigen Sprachschlüssel ersetzen, wenn keine deutschen Texte übernommen werden sollen","Replace by an invalid language key if German descriptions are not wanted","Sprache 1:","DEU","durch ungültigen Sprachschlüssel ersetzen, wenn keine deutschen Texte übernommen werden sollen","Replace by an invalid language key if German descriptions are not wanted","Sprache 1:","DEU","durch ungültigen Sprachschlüssel ersetzen, wenn keine deutschen Texte übernommen werden sollen","Replace by an invalid language key if German descriptions are not wanted","Sprache 1:","DEU","durch ungültigen Sprachschlüssel ersetzen, wenn keine deutschen Texte übernommen werden sollen","Replace by an invalid language key if German descriptions are not wanted","Sprache 1:","DEU","durch ungültigen Sprachschlüssel ersetzen, wenn keine deutschen Texte übernommen werden sollen","Replace by an invalid language key if German descriptions are not wanted","Sprache 1:","DEU","durch ungültigen Sprachschlüssel ersetzen, wenn keine deutschen Texte übernommen werden sollen","Replace by an invalid language key if German descriptions are not wanted","Sprache 1:","DEU","durch ungültigen Sprachschlüssel ersetzen, wenn keine deutschen Texte übernommen werden sollen","Replace by an invalid language key if German descriptions are not wanted","Sprache 1:","DEU","durch ungültigen Sprachschlüssel ersetzen, wenn keine deutschen Texte übernommen werden sollen","Replace by an invalid language key if German descriptions are not wanted","Sprache 1:","DEU","durch ungültigen Sprachschlüssel ersetzen, wenn keine deutschen Texte übernommen werden sollen","Replace by an invalid language key if German descriptions are not wanted","Sprache 1:","DEU","durch ungültigen Sprachschlüssel ersetzen, wenn keine deutschen Texte übernommen werden sollen","Replace by an invalid language key if German descriptions are not wanted","Sprache 1:","DEU","durch ungültigen Sprachschlüssel ersetzen, wenn keine deutschen Texte übernommen werden sollen","Replace by an invalid language key if German descriptions are not wanted","Sprache 1:","DEU","durch ungültigen Sprachschlüssel ersetzen, wenn keine deutschen Texte übernommen werden sollen","Replace by an invalid language key if German descriptions are not wanted","Sprache 1:","DEU","durch ungültigen Sprachschlüssel ersetzen, wenn keine deutschen Texte übernommen werden sollen","Replace by an invalid language key if German descriptions are not wanted","Sprache 1:","DEU","durch ungültigen Sprachschlüssel ersetzen, wenn keine deutschen Texte übernommen werden sollen","Replace by an invalid language key if German descriptions are not wanted","Sprache 1:","DEU","durch ungültigen Sprachschlüssel ersetzen, wenn keine deutschen Texte übernommen werden sollen","Replace by an invalid language key if German descriptions are not wanted","Sprache 1:","DEU","durch ungültigen Sprachschlüssel ersetzen, wenn keine deutschen Texte übernommen werden sollen","Replace by an invalid language key if German descriptions are not wanted","Sprache 1:","DEU","durch ungültigen Sprachschlüssel ersetzen, wenn keine deutschen Texte übernommen werden sollen","Replace by an invalid language key if German descriptions are not wanted","Sprache 1:","DEU","durch ungültigen Sprachschlüssel ersetzen, wenn keine deutschen Texte übernommen werden sollen","Replace by an invalid language key if German descriptions are not wanted","Sprache 1:","DEU","durch ungültigen Sprachschlüssel ersetzen, wenn keine deutschen Texte übernommen werden sollen","Replace by an invalid language key if German descriptions are not wanted","Sprache 1:","DEU","durch ungültigen Sprachschlüssel ersetzen, wenn keine deutschen Texte übernommen werden sollen","Replace by an invalid language key if German descriptions are not wanted","Sprache 1:","DEU","durch ungültigen Sprachschlüssel ersetzen, wenn keine deutschen Texte übernommen werden sollen","Replace by an invalid language key if German descriptions are not wanted","Sprache 1:","DEU","durch ungültigen Sprachschlüssel ersetzen, wenn keine deutschen Texte übernommen werden sollen","Replace by an invalid language key if German descriptions are not wanted","Sprache 1:","DEU","durch ungültigen Sprachschlüssel ersetzen, wenn keine deutschen Texte übernommen werden sollen","Replace by an invalid language key if German descriptions are not wanted","Sprache 1:","DEU","durch ungültigen Sprachschlüssel ersetzen, wenn keine deutschen Texte übernommen werden sollen","Replace by an invalid language key if German descriptions are not wanted","Sprache 1:","DEU","durch ungültigen Sprachschlüssel ersetzen, wenn keine deutschen Texte übernommen werden sollen","Replace by an invalid language key if German descriptions are not wanted","Sprache 1:","DEU","durch ungültigen Sprachschlüssel ersetzen, wenn keine deutschen Texte übernommen werden sollen","Replace by an invalid language key if German descriptions are not wanted","Sprache 1:","DEU","durch ungültigen Sprachschlüssel ersetzen, wenn keine deutschen Texte übernommen werden sollen","Replace by an invalid language key if German descriptions are not wanted","Sprache 1:","DEU","durch ungültigen Sprachschlüssel ersetzen, wenn keine deutschen Texte übernommen werden sollen","Replace by an invalid language key if German descriptions are not wanted","Sprache 1:","DEU","durch ungültigen Sprachschlüssel ersetzen, wenn keine deutschen Texte übernommen werden sollen","Replace by an invalid language key if German descriptions are not wanted","Sprache 1:","DEU","durch ungültigen Sprachschlüssel ersetzen, wenn keine deutschen Texte übernommen werden sollen","Replace by an invalid language key if German descriptions are not wanted","Sprache 1:","DEU","durch ungültigen Sprachschlüssel ersetzen, wenn keine deutschen Texte übernommen werden sollen","Replace by an invalid language key if German descriptions are not wanted","Sprache 1:","DEU","durch ungültigen Sprachschlüssel ersetzen, wenn keine deutschen Texte übernommen werden sollen","Replace by an invalid language key if German descriptions are not wanted","Sprache 1:","DEU","durch ungültigen Sprachschlüssel ersetzen, wenn keine deutschen Texte übernommen werden sollen","Replace by an invalid language key if German descriptions are not wanted","Sprache 1:","DEU","durch ungültigen Sprachschlüssel ersetzen, wenn keine deutschen Texte übernommen werden sollen","Replace by an invalid language key if German descriptions are not wanted","Sprache 1:","DEU","durch ungültigen Sprachschlüssel ersetzen, wenn keine deutschen Texte übernommen werden sollen","Replace by an invalid language key if German descriptions are not wanted","Sprache 1:","DEU","durch ungültigen Sprachschlüssel ersetzen, wenn keine deutschen Texte übernommen werden sollen","Replace by an invalid language key if German descriptions are not wanted","Sprache 1:","DEU","durch ungültigen Sprachschlüssel ersetzen, wenn keine deutschen Texte übernommen werden sollen","Replace by an invalid language key if German descriptions are not wanted","Sprache 1:","DEU","durch ungültigen Sprachschlüssel ersetzen, wenn keine deutschen Texte übernommen werden sollen","Replace by an invalid language key if German descriptions are not wanted","Sprache 1:","DEU","durch ungültigen Sprachschlüssel ersetzen, wenn keine deutschen Texte übernommen werden sollen","Replace by an invalid language key if German descriptions are not wanted","Sprache 1:","DEU","durch ungültigen Sprachschlüssel ersetzen, wenn keine deutschen Texte übernommen werden sollen","Replace by an invalid language key if German descriptions are not wanted","Sprache 1:","DEU","durch ungültigen Sprachschlüssel ersetzen, wenn keine deutschen Texte übernommen werden sollen","Replace by an invalid language key if German descriptions are not wanted","Sprache 1:","DEU","durch ungültigen Sprachschlüssel ersetzen, wenn keine deutschen Texte übernommen werden sollen","Replace by an invalid language key if German descriptions are not wanted","Sprache 1:","DEU","durch ungültigen Sprachschlüssel ersetzen, wenn keine deutschen Texte übernommen werden sollen","Replace by an invalid language key if German descriptions are not wanted","Sprache 1:","DEU","durch ungültigen Sprachschlüssel ersetzen, wenn keine deutschen Texte übernommen werden sollen","Replace by an invalid language key if German descriptions are not wanted","Sprache 1:","DEU","durch ungültigen Sprachschlüssel ersetzen, wenn keine deutschen Texte übernommen werden sollen","Replace by an invalid language key if German descriptions are not wanted","Sprache 1:","DEU","durch ungültigen Sprachschlüssel ersetzen, wenn keine deutschen Texte übernommen werden sollen","Replace by an invalid language key if German descriptions are not wanted","Sprache 1:","DEU","durch ungültigen Sprachschlüssel ersetzen, wenn keine deutschen Texte übernommen werden sollen","Replace by an invalid language key if German descriptions are not wanted","Sprache 1:","DEU","durch ungültigen Sprachschlüssel ersetzen, wenn keine deutschen Texte übernommen werden sollen","Replace by an invalid language key if German descriptions are not wanted","Sprache 1:","DEU","durch ungültigen Sprachschlüssel ersetzen, wenn keine deutschen Texte übernommen werden sollen","Replace by an invalid language key if German descriptions are not wanted","Sprache 1:","DEU","durch ungültigen Sprachschlüssel ersetzen, wenn keine deutschen Texte übernommen werden sollen","Replace by an invalid language key if German descriptions are not wanted","Sprache 1:","DEU","durch ungültigen Sprachschlüssel ersetzen, wenn keine deutschen Texte übernommen werden sollen","Replace by an invalid language key if German descriptions are not wanted","Sprache 1:","DEU","durch ungültigen Sprachschlüssel ersetzen, wenn keine deutschen Texte übernommen werden sollen","Replace by an invalid language key if German descriptions are not wanted","Sprache 1:","DEU","durch ungültigen Sprachschlüssel ersetzen, wenn keine deutschen Texte übernommen werden sollen","Replace by an invalid language key if German descriptions are not wanted","Sprache 1:","DEU","durch ungültigen Sprachschlüssel ersetzen, wenn keine deutschen Texte übernommen werden sollen","Replace by an invalid language key if German descriptions are not wanted","Sprache 1:","DEU","durch ungültigen Sprachschlüssel ersetzen, wenn keine deutschen Texte übernommen werden sollen","Replace by an invalid language key if German descriptions are not wanted","Sprache 1:","DEU","durch ungültigen Sprachschlüssel ersetzen, wenn keine deutschen Texte übernommen werden sollen","Replace by an invalid language key if German descriptions are not wanted","Sprache 1:","DEU","durch ungültigen Sprachschlüssel ersetzen, wenn keine deutschen Texte übernommen werden sollen","Replace by an invalid language key if German descriptions are not wanted","Sprache 1:","DEU","durch ungültigen Sprachschlüssel ersetzen, wenn keine deutschen Texte übernommen werden sollen","Replace by an invalid language key if German descriptions are not wanted","Sprache 1:","DEU","durch ungültigen Sprachschlüssel ersetzen, wenn keine deutschen Texte übernommen werden sollen","Replace by an invalid language key if German descriptions are not wanted","Sprache 1:","DEU","durch ungültigen Sprachschlüssel ersetzen, wenn keine deutschen Texte übernommen werden sollen","Replace by an invalid language key if German descriptions are not wanted","Sprache 1:","DEU","durch ungültigen Sprachschlüssel ersetzen, wenn keine deutschen Texte übernommen werden sollen","Replace by an invalid language key if German descriptions are not wanted","Sprache 1:","DEU","durch ungültigen Sprachschlüssel ersetzen, wenn keine deutschen Texte übernommen werden sollen","Replace by an invalid language key if German descriptions are not wanted","Sprache 1:","DEU","durch ungültigen Sprachschlüssel ersetzen, wenn keine deutschen Texte übernommen werden sollen","Replace by an invalid language key if German descriptions are not wanted","Sprache 1:","DEU","durch ungültigen Sprachschlüssel ersetzen, wenn keine deutschen Texte übernommen werden sollen","Replace by an invalid language key if German descriptions are not wanted","Sprache 1:","DEU","durch ungültigen Sprachschlüssel ersetzen, wenn keine deutschen Texte übernommen werden sollen","Replace by an invalid language key if German descriptions are not wanted","Sprache 1:","DEU","durch ungültigen Sprachschlüssel ersetzen, wenn keine deutschen Texte übernommen werden sollen","Replace by an invalid language key if German descriptions are not wanted","Sprache 1:","DEU","durch ungültigen Sprachschlüssel ersetzen, wenn keine deutschen Texte übernommen werden sollen","Replace by an invalid language key if German descriptions are not wanted","Sprache 1:","DEU","durch ungültigen Sprachschlüssel ersetzen, wenn keine deutschen Texte übernommen werden sollen","Replace by an invalid language key if German descriptions are not wanted","Sprache 1:","DEU","durch ungültigen Sprachschlüssel ersetzen, wenn keine deutschen Texte übernommen werden sollen","Replace by an invalid language key if German descriptions are not wanted","Sprache 1:","DEU","durch ungültigen Sprachschlüssel ersetzen, wenn keine deutschen Texte übernommen werden sollen","Replace by an invalid language key if German descriptions are not wanted","Sprache 1:","DEU","durch ungültigen Sprachschlüssel ersetzen, wenn keine deutschen Texte übernommen werden sollen","Replace by an invalid language key if German descriptions are not wanted","Sprache 1:","DEU","durch ungültigen Sprachschlüssel ersetzen, wenn keine deutschen Texte übernommen werden sollen","Replace by an invalid language key if German descriptions are not wanted","Sprache 1:","DEU","durch ungültigen Sprachschlüssel ersetzen, wenn keine deutschen Texte übernommen werden sollen","Replace by an invalid language key if German descriptions are not wanted","Sprache 1:","DEU","durch ungültigen Sprachschlüssel ersetzen, wenn keine deutschen Texte übernommen werden sollen","Replace by an invalid language key if German descriptions are not wanted","Sprache 1:","DEU","durch ungültigen Sprachschlüssel ersetzen, wenn keine deutschen Texte übernommen werden sollen","Replace by an invalid language key if German descriptions are not wanted","Sprache 1:","DEU","durch ungültigen Sprachschlüssel ersetzen, wenn keine deutschen Texte übernommen werden sollen","Replace by an invalid language key if German descriptions are not wanted","Sprache 1:","DEU","durch ungültigen Sprachschlüssel ersetzen, wenn keine deutschen Texte übernommen werden sollen","Replace by an invalid language key if German descriptions are not wanted","Sprache 1:","DEU","durch ungültigen Sprachschlüssel ersetzen, wenn keine deutschen Texte übernommen werden sollen","Replace by an invalid language key if German descriptions are not wanted","Sprache 1:","DEU","durch ungültigen Sprachschlüssel ersetzen, wenn keine deutschen Texte übernommen werden sollen","Replace by an invalid language key if German descriptions are not wanted","Sprache 1:","DEU","durch ungültigen Sprachschlüssel ersetzen, wenn keine deutschen Texte übernommen werden sollen","Replace by an invalid language key if German descriptions are not wanted","Sprache 1:","DEU","durch ungültigen Sprachschlüssel ersetzen, wenn keine deutschen Texte übernommen werden sollen","Replace by an invalid language key if German descriptions are not wanted","Sprache 1:","DEU","durch ungültigen Sprachschlüssel ersetzen, wenn keine deutschen Texte übernommen werden sollen","Replace by an invalid language key if German descriptions are not wanted","Sprache 1:","DEU","durch ungültigen Sprachschlüssel ersetzen, wenn keine deutschen Texte übernommen werden sollen","Replace by an invalid language key if German descriptions are not wanted","Sprache 1:","DEU","durch ungültigen Sprachschlüssel ersetzen, wenn keine deutschen Texte übernommen werden sollen","Replace by an invalid language key if German descriptions are not wanted","Sprache 1:","DEU","durch ungültigen Sprachschlüssel ersetzen, wenn keine deutschen Texte übernommen werden sollen","Replace by an invalid language key if German descriptions are not wanted","Sprache 1:","DEU","durch ungültigen Sprachschlüssel ersetzen, wenn keine deutschen Texte übernommen werden sollen","Replace by an invalid language key if German descriptions are not wanted","Sprache 1:","DEU","durch ungültigen Sprachschlüssel ersetzen, wenn keine deutschen Texte übernommen werden sollen","Replace by an invalid language key if German descriptions are not wanted","Sprache 1:","DEU","durch ungültigen Sprachschlüssel ersetzen, wenn keine deutschen Texte übernommen werden sollen","Replace by an invalid language key if German descriptions are not wanted","Sprache 1:","DEU","durch ungültigen Sprachschlüssel ersetzen, wenn keine deutschen Texte übernommen werden sollen","Replace by an invalid language key if German descriptions are not wanted","Sprache 1:","DEU","durch ungültigen Sprachschlüssel ersetzen, wenn keine deutschen Texte übernommen werden sollen","Replace by an invalid language key if German descriptions are not wanted","Sprache 1:","DEU","durch ungültigen Sprachschlüssel ersetzen, wenn keine deutschen Texte übernommen werden sollen","Replace by an invalid language key if German descriptions are not wanted","Sprache 1:","DEU","durch ungültigen Sprachschlüssel ersetzen, wenn keine deutschen Texte übernommen werden sollen","Replace by an invalid language key if German descriptions are not wanted","Sprache 1:","DEU","durch ungültigen Sprachschlüssel ersetzen, wenn keine deutschen Texte übernommen werden sollen","Replace by an invalid language key if German descriptions are not wanted","Sprache 1:","DEU","durch ungültigen Sprachschlüssel ersetzen, wenn keine deutschen Texte übernommen werden sollen","Replace by an invalid language key if German descriptions are not wanted","Sprache 1:","DEU","durch ungültigen Sprachschlüssel ersetzen, wenn keine deutschen Texte übernommen werden sollen","Replace by an invalid language key if German descriptions are not wanted","Sprache 1:","DEU","durch ungültigen Sprachschlüssel ersetzen, wenn keine deutschen Texte übernommen werden sollen","Replace by an invalid language key if German descriptions are not wanted","Sprache 1:","DEU","durch ungültigen Sprachschlüssel ersetzen, wenn keine deutschen Texte übernommen werden sollen","Replace by an invalid language key if German descriptions are not wanted","Sprache 1:","DEU","durch ungültigen Sprachschlüssel ersetzen, wenn keine deutschen Texte übernommen werden sollen","Replace by an invalid language key if German descriptions are not wanted","Sprache 1:","DEU","durch ungültigen Sprachschlüssel ersetzen, wenn keine deutschen Texte übernommen werden sollen","Replace by an invalid language key if German descriptions are not wanted","Sprache 1:","DEU","durch ungültigen Sprachschlüssel ersetzen, wenn keine deutschen Texte übernommen werden sollen","Replace by an invalid language key if German descriptions are not wanted","Sprache 1:","DEU","durch ungültigen Sprachschlüssel ersetzen, wenn keine deutschen Texte übernommen werden sollen","Replace by an invalid language key if German descriptions are not wanted","Sprache 1:","DEU","durch ungültigen Sprachschlüssel ersetzen, wenn keine deutschen Texte übernommen werden sollen","Replace by an invalid language key if German descriptions are not wanted","Sprache 1:","DEU","durch ungültigen Sprachschlüssel ersetzen, wenn keine deutschen Texte übernommen werden sollen","Replace by an invalid language key if German descriptions are not wanted","Sprache 1:","DEU","durch ungültigen Sprachschlüssel ersetzen, wenn keine deutschen Texte übernommen werden sollen","Replace by an invalid language key if German descriptions are not wanted","Sprache 1:","DEU","durch ungültigen Sprachschlüssel ersetzen, wenn keine deutschen Texte übernommen werden sollen","Replace by an invalid language key if German descriptions are not wanted","Sprache 1:","DEU","durch ungültigen Sprachschlüssel ersetzen, wenn keine deutschen Texte übernommen werden sollen","Replace by an invalid language key if German descriptions are not wanted","Sprache 1:","DEU","durch ungültigen Sprachschlüssel ersetzen, wenn keine deutschen Texte übernommen werden sollen","Replace by an invalid language key if German descriptions are not wanted","Sprache 1:","DEU","durch ungültigen Sprachschlüssel ersetzen, wenn keine deutschen Texte übernommen werden sollen","Replace by an invalid language key if German descriptions are not wanted","Sprache 1:","DEU","durch ungültigen Sprachschlüssel ersetzen, wenn keine deutschen Texte übernommen werden sollen","Replace by an invalid language key if German descriptions are not wanted","Sprache 1:","DEU","durch ungültigen Sprachschlüssel ersetzen, wenn keine deutschen Texte übernommen werden sollen","Replace by an invalid language key if German descriptions are not wanted","Sprache 1:","DEU","durch ungültigen Sprachschlüssel ersetzen, wenn keine deutschen Texte übernommen werden sollen","Replace by an invalid language key if German descriptions are not wanted","Sprache 1:","DEU","durch ungültigen Sprachschlüssel ersetzen, wenn keine deutschen Texte übernommen werden sollen","Replace by an invalid language key if German descriptions are not wanted","Sprache 1:","DEU","durch ungültigen Sprachschlüssel ersetzen, wenn keine deutschen Texte übernommen werden sollen","Replace by an invalid language key if German descriptions are not wanted","Sprache 1:","DEU","durch ungültigen Sprachschlüssel ersetzen, wenn keine deutschen Texte übernommen werden sollen","Replace by an invalid language key if German descriptions are not wanted","Sprache 1:","DEU","durch ungültigen Sprachschlüssel ersetzen, wenn keine deutschen Texte übernommen werden sollen","Replace by an invalid language key if German descriptions are not wanted","Sprache 1:","DEU","durch ungültigen Sprachschlüssel ersetzen, wenn keine deutschen Texte übernommen werden sollen","Replace by an invalid language key if German descriptions are not wanted","Sprache 1:","DEU","durch ungültigen Sprachschlüssel ersetzen, wenn keine deutschen Texte übernommen werden sollen","Replace by an invalid language key if German descriptions are not wanted","Sprache 1:","DEU","durch ungültigen Sprachschlüssel ersetzen, wenn keine deutschen Texte übernommen werden sollen","Replace by an invalid language key if German descriptions are not wanted","Sprache 1:","DEU","durch ungültigen Sprachschlüssel ersetzen, wenn keine deutschen Texte übernommen werden sollen","Replace by an invalid language key if German descriptions are not wanted","Sprache 1:","DEU","durch ungültigen Sprachschlüssel ersetzen, wenn keine deutschen Texte übernommen werden sollen","Replace by an invalid language key if German descriptions are not wanted","Sprache 1:","DEU","durch ungültigen Sprachschlüssel ersetzen, wenn keine deutschen Texte übernommen werden sollen","Replace by an invalid language key if German descriptions are not wanted","Sprache 1:","DEU","durch ungültigen Sprachschlüssel ersetzen, wenn keine deutschen Texte übernommen werden sollen","Replace by an invalid language key if German descriptions are not wanted","Sprache 1:","DEU","durch ungültigen Sprachschlüssel ersetzen, wenn keine deutschen Texte übernommen werden sollen","Replace by an invalid language key if German descriptions are not wanted","Sprache 1:","DEU","durch ungültigen Sprachschlüssel ersetzen, wenn keine deutschen Texte übernommen werden sollen","Replace by an invalid language key if German descriptions are not wanted","Sprache 1:","DEU","durch ungültigen Sprachschlüssel ersetzen, wenn keine deutschen Texte übernommen werden sollen","Replace by an invalid language key if German descriptions are not wanted","Sprache 1:","DEU","durch ungültigen Sprachschlüssel ersetzen, wenn keine deutschen Texte übernommen werden sollen","Replace by an invalid language key if German descriptions are not wanted","Sprache 1:","DEU","durch ungültigen Sprachschlüssel ersetzen, wenn keine deutschen Texte übernommen werden sollen","Replace by an invalid language key if German descriptions are not wanted","Sprache 1:","DEU","durch ungültigen Sprachschlüssel ersetzen, wenn keine deutschen Texte übernommen werden sollen","Replace by an invalid language key if German descriptions are not wanted","Sprache 1:","DEU","durch ungültigen Sprachschlüssel ersetzen, wenn keine deutschen Texte übernommen werden sollen","Replace by an invalid language key if German descriptions are not wanted","Sprache 1:","DEU","durch ungültigen Sprachschlüssel ersetzen, wenn keine deutschen Texte übernommen werden sollen","Replace by an invalid language key if German descriptions are not wanted","Sprache 1:","DEU","durch ungültigen Sprachschlüssel ersetzen, wenn keine deutschen Texte übernommen werden sollen","Replace by an invalid language key if German descriptions are not wanted","Sprache 1:","DEU","durch ungültigen Sprachschlüssel ersetzen, wenn keine deutschen Texte übernommen werden sollen","Replace by an invalid language key if German descriptions are not wanted","Sprache 1:","DEU","durch ungültigen Sprachschlüssel ersetzen, wenn keine deutschen Texte übernommen werden sollen","Replace by an invalid language key if German descriptions are not wanted","Sprache 1:","DEU","durch ungültigen Sprachschlüssel ersetzen, wenn keine deutschen Texte übernommen werden sollen","Replace by an invalid language key if German descriptions are not wanted","Sprache 1:","DEU","durch ungültigen Sprachschlüssel ersetzen, wenn keine deutschen Texte übernommen werden sollen","Replace by an invalid language key if German descriptions are not wanted","Sprache 1:","DEU","durch ungültigen Sprachschlüssel ersetzen, wenn keine deutschen Texte übernommen werden sollen","Replace by an invalid language key if German descriptions are not wanted","Sprache 1:","DEU","durch ungültigen Sprachschlüssel ersetzen, wenn keine deutschen Texte übernommen werden sollen","Replace by an invalid language key if German descriptions are not wanted","Sprache 1:","DEU","durch ungültigen Sprachschlüssel ersetzen, wenn keine deutschen Texte übernommen werden sollen","Replace by an invalid language key if German descriptions are not wanted","Sprache 1:","DEU","durch ungültigen Sprachschlüssel ersetzen, wenn keine deutschen Texte übernommen werden sollen","Replace by an invalid language key if German descriptions are not wanted","Sprache 1:","DEU","durch ungültigen Sprachschlüssel ersetzen, wenn keine deutschen Texte übernommen werden sollen","Replace by an invalid language key if German descriptions are not wanted","Sprache 1:","DEU","durch ungültigen Sprachschlüssel ersetzen, wenn keine deutschen Texte übernommen werden sollen","Replace by an invalid language key if German descriptions are not wanted","Sprache 1:","DEU","durch ungültigen Sprachschlüssel ersetzen, wenn keine deutschen Texte übernommen werden sollen","Replace by an invalid language key if German descriptions are not wanted","Sprache 1:","DEU","durch ungültigen Sprachschlüssel ersetzen, wenn keine deutschen Texte übernommen werden sollen","Replace by an invalid language key if German descriptions are not wanted","Sprache 1:","DEU","durch ungültigen Sprachschlüssel ersetzen, wenn keine deutschen Texte übernommen werden sollen","Replace by an invalid language key if German descriptions are not wanted","Sprache 1:","DEU","durch ungültigen Sprachschlüssel ersetzen, wenn keine deutschen Texte übernommen werden sollen","Replace by an invalid language key if German descriptions are not wanted","Sprache 1:","DEU","durch ungültigen Sprachschlüssel ersetzen, wenn keine deutschen Texte übernommen werden sollen","Replace by an invalid language key if German descriptions are not wanted","Sprache 1:","DEU","durch ungültigen Sprachschlüssel ersetzen, wenn keine deutschen Texte übernommen werden sollen","Replace by an invalid language key if German descriptions are not wanted","Sprache 1:","DEU","durch ungültigen Sprachschlüssel ersetzen, wenn keine deutschen Texte übernommen werden sollen","Replace by an invalid language key if German descriptions are not wanted","Sprache 1:","DEU","durch ungültigen Sprachschlüssel ersetzen, wenn keine deutschen Texte übernommen werden sollen","Replace by an invalid language key if German descriptions are not wanted","Sprache 1:","DEU","durch ungültigen Sprachschlüssel ersetzen, wenn keine deutschen Texte übernommen werden sollen","Replace by an invalid language key if German descriptions are not wanted","Sprache 1:","DEU","durch ungültigen Sprachschlüssel ersetzen, wenn keine deutschen Texte übernommen werden sollen","Replace by an invalid language key if German descriptions are not wanted","Sprache 1:","DEU","durch ungültigen Sprachschlüssel ersetzen, wenn keine deutschen Texte übernommen werden sollen","Replace by an invalid language key if German descriptions are not wanted","Sprache 1:","DEU","durch ungültigen Sprachschlüssel ersetzen, wenn keine deutschen Texte übernommen werden sollen","Replace by an invalid language key if German descriptions are not wanted","Sprache 1:","DEU","durch ungültigen Sprachschlüssel ersetzen, wenn keine deutschen Texte übernommen werden sollen","Replace by an invalid language key if German descriptions are not wanted","Sprache 1:","DEU","durch ungültigen Sprachschlüssel ersetzen, wenn keine deutschen Texte übernommen werden sollen","Replace by an invalid language key if German descriptions are not wanted","Sprache 1:","DEU","durch ungültigen Sprachschlüssel ersetzen, wenn keine deutschen Texte übernommen werden sollen","Replace by an invalid language key if German descriptions are not wanted","Sprache 1:","DEU","durch ungültigen Sprachschlüssel ersetzen, wenn keine deutschen Texte übernommen werden sollen","Replace by an invalid language key if German descriptions are not wanted","Sprache 1:","DEU","durch ungültigen Sprachschlüssel ersetzen, wenn keine deutschen Texte übernommen werden sollen","Replace by an invalid language key if German descriptions are not wanted","Sprache 1:","DEU","durch ungültigen Sprachschlüssel ersetzen, wenn keine deutschen Texte übernommen werden sollen","Replace by an invalid language key if German descriptions are not wanted","Sprache 1:","DEU","durch ungültigen Sprachschlüssel ersetzen, wenn keine deutschen Texte übernommen werden sollen","Replace by an invalid language key if German descriptions are not wanted","Sprache 1:","DEU","durch ungültigen Sprachschlüssel ersetzen, wenn keine deutschen Texte übernommen werden sollen","Replace by an invalid language key if German descriptions are not wanted","Sprache 1:","DEU","durch ungültigen Sprachschlüssel ersetzen, wenn keine deutschen Texte übernommen werden sollen","Replace by an invalid language key if German descriptions are not wanted","Sprache 1:","DEU","durch ungültigen Sprachschlüssel ersetzen, wenn keine deutschen Texte übernommen werden sollen","Replace by an invalid language key if German descriptions are not wanted","Sprache 1:","DEU","durch ungültigen Sprachschlüssel ersetzen, wenn keine deutschen Texte übernommen werden sollen","Replace by an invalid language key if German descriptions are not wanted","Sprache 1:","DEU","durch ungültigen Sprachschlüssel ersetzen, wenn keine deutschen Texte übernommen werden sollen","Replace by an invalid language key if German descriptions are not wanted","Sprache 1:","DEU","durch ungültigen Sprachschlüssel ersetzen, wenn keine deutschen Texte übernommen werden sollen","Replace by an invalid language key if German descriptions are not wanted","Sprache 1:","DEU","durch ungültigen Sprachschlüssel ersetzen, wenn keine deutschen Texte übernommen werden sollen","Replace by an invalid language key if German descriptions are not wanted","Sprache 1:","DEU","durch ungültigen Sprachschlüssel ersetzen, wenn keine deutschen Texte übernommen werden sollen","Replace by an invalid language key if German descriptions are not wanted","Sprache 1:","DEU","durch ungültigen Sprachschlüssel ersetzen, wenn keine deutschen Texte übernommen werden sollen","Replace by an invalid language key if German descriptions are not wanted","Sprache 1:","DEU","durch ungültigen Sprachschlüssel ersetzen, wenn keine deutschen Texte übernommen werden sollen","Replace by an invalid language key if German descriptions are not wanted","Sprache 1:","DEU","durch ungültigen Sprachschlüssel ersetzen, wenn keine deutschen Texte übernommen werden sollen","Replace by an invalid language key if German descriptions are not wanted","Sprache 1:","DEU","durch ungültigen Sprachschlüssel ersetzen, wenn keine deutschen Texte übernommen werden sollen","Replace by an invalid language key if German descriptions are not wanted","Sprache 1:","DEU","durch ungültigen Sprachschlüssel ersetzen, wenn keine deutschen Texte übernommen werden sollen","Replace by an invalid language key if German descriptions are not wanted","Sprache 1:","DEU","durch ungültigen Sprachschlüssel ersetzen, wenn keine deutschen Texte übernommen werden sollen","Replace by an invalid language key if German descriptions are not wanted","Sprache 1:","DEU","durch ungültigen Sprachschlüssel ersetzen, wenn keine deutschen Texte übernommen werden sollen","Replace by an invalid language key if German descriptions are not wanted","Sprache 1:","DEU","durch ungültigen Sprachschlüssel ersetzen, wenn keine deutschen Texte übernommen werden sollen","Replace by an invalid language key if German descriptions are not wanted","Sprache 1:","DEU","durch ungültigen Sprachschlüssel ersetzen, wenn keine deutschen Texte übernommen werden sollen","Replace by an invalid language key if German descriptions are not wanted","Sprache 1:","DEU","durch ungültigen Sprachschlüssel ersetzen, wenn keine deutschen Texte übernommen werden sollen","Replace by an invalid language key if German descriptions are not wanted","Sprache 1:","DEU","durch ungültigen Sprachschlüssel ersetzen, wenn keine deutschen Texte übernommen werden sollen","Replace by an invalid language key if German descriptions are not wanted","Sprache 1:","DEU","durch ungültigen Sprachschlüssel ersetzen, wenn keine deutschen Texte übernommen werden sollen","Replace by an invalid language key if German descriptions are not wanted","Sprache 1:","DEU","durch ungültigen Sprachschlüssel ersetzen, wenn keine deutschen Texte übernommen werden sollen","Replace by an invalid language key if German descriptions are not wanted","Sprache 1:","DEU","durch ungültigen Sprachschlüssel ersetzen, wenn keine deutschen Texte übernommen werden sollen","Replace by an invalid language key if German descriptions are not wanted","Sprache 1:","DEU","durch ungültigen Sprachschlüssel ersetzen, wenn keine deutschen Texte übernommen werden sollen","Replace by an invalid language key if German descriptions are not wanted","Sprache 1:","DEU","durch ungültigen Sprachschlüssel ersetzen, wenn keine deutschen Texte übernommen werden sollen","Replace by an invalid language key if German descriptions are not wanted","Sprache 1:","DEU","durch ungültigen Sprachschlüssel ersetzen, wenn keine deutschen Texte übernommen werden sollen","Replace by an invalid language key if German descriptions are not wanted","Sprache 1:","DEU","durch ungültigen Sprachschlüssel ersetzen, wenn keine deutschen Texte übernommen werden sollen","Replace by an invalid language key if German descriptions are not wanted","Sprache 1:","DEU","durch ungültigen Sprachschlüssel ersetzen, wenn keine deutschen Texte übernommen werden sollen","Replace by an invalid language key if German descriptions are not wanted","Sprache 1:","DEU","durch ungültigen Sprachschlüssel ersetzen, wenn keine deutschen Texte übernommen werden sollen","Replace by an invalid language key if German descriptions are not wanted","Sprache 1:","DEU","durch ungültigen Sprachschlüssel ersetzen, wenn keine deutschen Texte übernommen werden sollen","Replace by an invalid language key if German descriptions are not wanted","Sprache 1:","DEU","durch ungültigen Sprachschlüssel ersetzen, wenn keine deutschen Texte übernommen werden sollen","Replace by an invalid language key if German descriptions are not wanted","Sprache 1:","DEU","durch ungültigen Sprachschlüssel ersetzen, wenn keine deutschen Texte übernommen werden sollen","Replace by an invalid language key if German descriptions are not wanted","Sprache 1:","DEU","durch ungültigen Sprachschlüssel ersetzen, wenn keine deutschen Texte übernommen werden sollen","Replace by an invalid language key if German descriptions are not wanted","Sprache 1:","DEU","durch ungültigen Sprachschlüssel ersetzen, wenn keine deutschen Texte übernommen werden sollen","Replace by an invalid language key if German descriptions are not wanted","Sprache 1:","DEU","durch ungültigen Sprachschlüssel ersetzen, wenn keine deutschen Texte übernommen werden sollen","Replace by an invalid language key if German descriptions are not wanted","Sprache 1:","DEU","durch ungültigen Sprachschlüssel ersetzen, wenn keine deutschen Texte übernommen werden sollen","Replace by an invalid language key if German descriptions are not wanted","Sprache 1:","DEU","durch ungültigen Sprachschlüssel ersetzen, wenn keine deutschen Texte übernommen werden sollen","Replace by an invalid language key if German descriptions are not wanted","Sprache 1:","DEU","durch ungültigen Sprachschlüssel ersetzen, wenn keine deutschen Texte übernommen werden sollen","Replace by an invalid language key if German descriptions are not wanted","Sprache 1:","DEU","durch ungültigen Sprachschlüssel ersetzen, wenn keine deutschen Texte übernommen werden sollen","Replace by an invalid language key if German descriptions are not wanted","Sprache 1:","DEU","durch ungültigen Sprachschlüssel ersetzen, wenn keine deutschen Texte übernommen werden sollen","Replace by an invalid language key if German descriptions are not wanted","Sprache 1:","DEU","durch ungültigen Sprachschlüssel ersetzen, wenn keine deutschen Texte übernommen werden sollen","Replace by an invalid language key if German descriptions are not wanted","Sprache 1:","DEU","durch ungültigen Sprachschlüssel ersetzen, wenn keine deutschen Texte übernommen werden sollen","Replace by an invalid language key if German descriptions are not wanted","Sprache 1:","DEU","durch ungültigen Sprachschlüssel ersetzen, wenn keine deutschen Texte übernommen werden sollen","Replace by an invalid language key if German descriptions are not wanted","Sprache 1:","DEU","durch ungültigen Sprachschlüssel ersetzen, wenn keine deutschen Texte übernommen werden sollen","Replace by an invalid language key if German descriptions are not wanted","Sprache 1:","DEU","durch ungültigen Sprachschlüssel ersetzen, wenn keine deutschen Texte übernommen werden sollen","Replace by an invalid language key if German descriptions are not wanted","Sprache 1:","DEU","durch ungültigen Sprachschlüssel ersetzen, wenn keine deutschen Texte übernommen werden sollen","Replace by an invalid language key if German descriptions are not wanted","Sprache 1:","DEU","durch ungültigen Sprachschlüssel ersetzen, wenn keine deutschen Texte übernommen werden sollen","Replace by an invalid language key if German descriptions are not wanted","Sprache 1:","DEU","durch ungültigen Sprachschlüssel ersetzen, wenn keine deutschen Texte übernommen werden sollen","Replace by an invalid language key if German descriptions are not wanted","Sprache 1:","DEU","durch ungültigen Sprachschlüssel ersetzen, wenn keine deutschen Texte übernommen werden sollen","Replace by an invalid language key if German descriptions are not wanted","Sprache 1:","DEU","durch ungültigen Sprachschlüssel ersetzen, wenn keine deutschen Texte übernommen werden sollen","Replace by an invalid language key if German descriptions are not wanted","Sprache 1:","DEU","durch ungültigen Sprachschlüssel ersetzen, wenn keine deutschen Texte übernommen werden sollen","Replace by an invalid language key if German descriptions are not wanted","Sprache 1:","DEU","durch ungültigen Sprachschlüssel ersetzen, wenn keine deutschen Texte übernommen werden sollen","Replace by an invalid language key if German descriptions are not wanted","Sprache 1:","DEU","durch ungültigen Sprachschlüssel ersetzen, wenn keine deutschen Texte übernommen werden sollen","Replace by an invalid language key if German descriptions are not wanted","Sprache 1:","DEU","durch ungültigen Sprachschlüssel ersetzen, wenn keine deutschen Texte übernommen werden sollen","Replace by an invalid language key if German descriptions are not wanted","Sprache 1:","DEU","durch ungültigen Sprachschlüssel ersetzen, wenn keine deutschen Texte übernommen werden sollen","Replace by an invalid language key if German descriptions are not wanted","Sprache 1:","DEU","durch ungültigen Sprachschlüssel ersetzen, wenn keine deutschen Texte übernommen werden sollen","Replace by an invalid language key if German descriptions are not wanted","Sprache 1:","DEU","durch ungültigen Sprachschlüssel ersetzen, wenn keine deutschen Texte übernommen werden sollen","Replace by an invalid language key if German descriptions are not wanted","Sprache 1:","DEU","durch ungültigen Sprachschlüssel ersetzen, wenn keine deutschen Texte übernommen werden sollen","Replace by an invalid language key if German descriptions are not wanted","Sprache 1:","DEU","durch ungültigen Sprachschlüssel ersetzen, wenn keine deutschen Texte übernommen werden sollen","Replace by an invalid language key if German descriptions are not wanted","Sprache 1:","DEU","durch ungültigen Sprachschlüssel ersetzen, wenn keine deutschen Texte übernommen werden sollen","Replace by an invalid language key if German descriptions are not wanted","Sprache 1:","DEU","durch ungültigen Sprachschlüssel ersetzen, wenn keine deutschen Texte übernommen werden sollen","Replace by an invalid language key if German descriptions are not wanted","Sprache 1:","DEU","durch ungültigen Sprachschlüssel ersetzen, wenn keine deutschen Texte übernommen werden sollen","Replace by an invalid language key if German descriptions are not wanted","Sprache 1:","DEU","durch ungültigen Sprachschlüssel ersetzen, wenn keine deutschen Texte übernommen werden sollen","Replace by an invalid language key if German descriptions are not wanted","Sprache 1:","DEU","durch ungültigen Sprachschlüssel ersetzen, wenn keine deutschen Texte übernommen werden sollen","Replace by an invalid language key if German descriptions are not wanted","Sprache 1:","DEU","durch ungültigen Sprachschlüssel ersetzen, wenn keine deutschen Texte übernommen werden sollen","Replace by an invalid language key if German descriptions are not wanted","Sprache 1:","DEU","durch ungültigen Sprachschlüssel ersetzen, wenn keine deutschen Texte übernommen werden sollen","Replace by an invalid language key if German descriptions are not wanted","Sprache 1:","DEU","durch ungültigen Sprachschlüssel ersetzen, wenn keine deutschen Texte übernommen werden sollen","Replace by an invalid language key if German descriptions are not wanted","Sprache 1:","DEU","durch ungültigen Sprachschlüssel ersetzen, wenn keine deutschen Texte übernommen werden sollen","Replace by an invalid language key if German descriptions are not wanted","Sprache 1:","DEU","durch ungültigen Sprachschlüssel ersetzen, wenn keine deutschen Texte übernommen werden sollen","Replace by an invalid language key if German descriptions are not wanted","Sprache 1:","DEU","durch ungültigen Sprachschlüssel ersetzen, wenn keine deutschen Texte übernommen werden sollen","Replace by an invalid language key if German descriptions are not wanted","Sprache 1:","DEU","durch ungültigen Sprachschlüssel ersetzen, wenn keine deutschen Texte übernommen werden sollen","Replace by an invalid language key if German descriptions are not wanted","Sprache 1:","DEU","durch ungültigen Sprachschlüssel ersetzen, wenn keine deutschen Texte übernommen werden sollen","Replace by an invalid language key if German descriptions are not wanted","Sprache 1:","DEU","durch ungültigen Sprachschlüssel ersetzen, wenn keine deutschen Texte übernommen werden sollen","Replace by an invalid language key if German descriptions are not wanted","Sprache 1:","DEU","durch ungültigen Sprachschlüssel ersetzen, wenn keine deutschen Texte übernommen werden sollen","Replace by an invalid language key if German descriptions are not wanted","Sprache 1:","DEU","durch ungültigen Sprachschlüssel ersetzen, wenn keine deutschen Texte übernommen werden sollen","Replace by an invalid language key if German descriptions are not wanted","Sprache 1:","DEU","durch ungültigen Sprachschlüssel ersetzen, wenn keine deutschen Texte übernommen werden sollen","Replace by an invalid language key if German descriptions are not wanted","Sprache 1:","DEU","durch ungültigen Sprachschlüssel ersetzen, wenn keine deutschen Texte übernommen werden sollen","Replace by an invalid language key if German descriptions are not wanted","Sprache 1:","DEU","durch ungültigen Sprachschlüssel ersetzen, wenn keine deutschen Texte übernommen werden sollen","Replace by an invalid language key if German descriptions are not wanted","Sprache 1:","DEU","durch ungültigen Sprachschlüssel ersetzen, wenn keine deutschen Texte übernommen werden sollen","Replace by an invalid language key if German descriptions are not wanted","Sprache 1:","DEU","durch ungültigen Sprachschlüssel ersetzen, wenn keine deutschen Texte übernommen werden sollen","Replace by an invalid language key if German descriptions are not wanted","Sprache 1:","DEU","durch ungültigen Sprachschlüssel ersetzen, wenn keine deutschen Texte übernommen werden sollen","Replace by an invalid language key if German descriptions are not wanted","Sprache 1:","DEU","durch ungültigen Sprachschlüssel ersetzen, wenn keine deutschen Texte übernommen werden sollen","Replace by an invalid language key if German descriptions are not wanted","Sprache 1:","DEU","durch ungültigen Sprachschlüssel ersetzen, wenn keine deutschen Texte übernommen werden sollen","Replace by an invalid language key if German descriptions are not wanted","Sprache 1:","DEU","durch ungültigen Sprachschlüssel ersetzen, wenn keine deutschen Texte übernommen werden sollen","Replace by an invalid language key if German descriptions are not wanted","Sprache 1:","DEU","durch ungültigen Sprachschlüssel ersetzen, wenn keine deutschen Texte übernommen werden sollen","Replace by an invalid language key if German descriptions are not wanted","Sprache 1:","DEU","durch ungültigen Sprachschlüssel ersetzen, wenn keine deutschen Texte übernommen werden sollen","Replace by an invalid language key if German descriptions are not wanted","Sprache 1:","DEU","durch ungültigen Sprachschlüssel ersetzen, wenn keine deutschen Texte übernommen werden sollen","Replace by an invalid language key if German descriptions are not wanted","Sprache 1:","DEU","durch ungültigen Sprachschlüssel ersetzen, wenn keine deutschen Texte übernommen werden sollen","Replace by an invalid language key if German descriptions are not wanted","Sprache 1:","DEU","durch ungültigen Sprachschlüssel ersetzen, wenn keine deutschen Texte übernommen werden sollen","Replace by an invalid language key if German descriptions are not wanted","Sprache 1:","DEU","durch ungültigen Sprachschlüssel ersetzen, wenn keine deutschen Texte übernommen werden sollen","Replace by an invalid language key if German descriptions are not wanted","Sprache 1:","DEU","durch ungültigen Sprachschlüssel ersetzen, wenn keine deutschen Texte übernommen werden sollen","Replace by an invalid language key if German descriptions are not wanted","Sprache 1:","DEU","durch ungültigen Sprachschlüssel ersetzen, wenn keine deutschen Texte übernommen werden sollen","Replace by an invalid language key if German descriptions are not wanted","Sprache 1:","DEU","durch ungültigen Sprachschlüssel ersetzen, wenn keine deutschen Texte übernommen werden sollen","Replace by an invalid language key if German descriptions are not wanted","Sprache 1:","DEU","durch ungültigen Sprachschlüssel ersetzen, wenn keine deutschen Texte übernommen werden sollen","Replace by an invalid language key if German descriptions are not wanted","Sprache 1:","DEU","durch ungültigen Sprachschlüssel ersetzen, wenn keine deutschen Texte übernommen werden sollen","Replace by an invalid language key if German descriptions are not wanted","Sprache 1:","DEU","durch ungültigen Sprachschlüssel ersetzen, wenn keine deutschen Texte übernommen werden sollen","Replace by an invalid language key if German descriptions are not wanted","Sprache 1:","DEU","durch ungültigen Sprachschlüssel ersetzen, wenn keine deutschen Texte übernommen werden sollen","Replace by an invalid language key if German descriptions are not wanted","Sprache 1:","DEU","durch ungültigen Sprachschlüssel ersetzen, wenn keine deutschen Texte übernommen werden sollen","Replace by an invalid language key if German descriptions are not wanted","Sprache 1:","DEU","durch ungültigen Sprachschlüssel ersetzen, wenn keine deutschen Texte übernommen werden sollen","Replace by an invalid language key if German descriptions are not wanted","Sprache 1:","DEU","durch ungültigen Sprachschlüssel ersetzen, wenn keine deutschen Texte übernommen werden sollen","Replace by an invalid language key if German descriptions are not wanted","Sprache 1:","DEU","durch ungültigen Sprachschlüssel ersetzen, wenn keine deutschen Texte übernommen werden sollen","Replace by an invalid language key if German descriptions are not wanted","Sprache 1:","DEU","durch ungültigen Sprachschlüssel ersetzen, wenn keine deutschen Texte übernommen werden sollen","Replace by an invalid language key if German descriptions are not wanted","Sprache 1:","DEU","durch ungültigen Sprachschlüssel ersetzen, wenn keine deutschen Texte übernommen werden sollen","Replace by an invalid language key if German descriptions are not wanted","Sprache 1:","DEU","durch ungültigen Sprachschlüssel ersetzen, wenn keine deutschen Texte übernommen werden sollen","Replace by an invalid language key if German descriptions are not wanted","Sprache 1:","DEU","durch ungültigen Sprachschlüssel ersetzen, wenn keine deutschen Texte übernommen werden sollen","Replace by an invalid language key if German descriptions are not wanted","Sprache 1:","DEU","durch ungültigen Sprachschlüssel ersetzen, wenn keine deutschen Texte übernommen werden sollen","Replace by an invalid language key if German descriptions are not wanted","Sprache 1:","DEU","durch ungültigen Sprachschlüssel ersetzen, wenn keine deutschen Texte übernommen werden sollen","Replace by an invalid language key if German descriptions are not wanted","Sprache 1:","DEU","durch ungültigen Sprachschlüssel ersetzen, wenn keine deutschen Texte übernommen werden sollen","Replace by an invalid language key if German descriptions are not wanted","Sprache 1:","DEU","durch ungültigen Sprachschlüssel ersetzen, wenn keine deutschen Texte übernommen werden sollen","Replace by an invalid language key if German descriptions are not wanted","Sprache 1:","DEU","durch ungültigen Sprachschlüssel ersetzen, wenn keine deutschen Texte übernommen werden sollen","Replace by an invalid language key if German descriptions are not wanted","Sprache 1:","DEU","durch ungültigen Sprachschlüssel ersetzen, wenn keine deutschen Texte übernommen werden sollen","Replace by an invalid language key if German descriptions are not wanted","Sprache 1:","DEU","durch ungültigen Sprachschlüssel ersetzen, wenn keine deutschen Texte übernommen werden sollen","Replace by an invalid language key if German descriptions are not wanted","Sprache 1:","DEU","durch ungültigen Sprachschlüssel ersetzen, wenn keine deutschen Texte übernommen werden sollen","Replace by an invalid language key if German descriptions are not wanted","Sprache 1:","DEU","durch ungültigen Sprachschlüssel ersetzen, wenn keine deutschen Texte übernommen werden sollen","Replace by an invalid language key if German descriptions are not wanted","Sprache 1:","DEU","durch ungültigen Sprachschlüssel ersetzen, wenn keine deutschen Texte übernommen werden sollen","Replace by an invalid language key if German descriptions are not wanted","Sprache 1:","DEU","durch ungültigen Sprachschlüssel ersetzen, wenn keine deutschen Texte übernommen werden sollen","Replace by an invalid language key if German descriptions are not wanted","Sprache 1:","DEU","durch ungültigen Sprachschlüssel ersetzen, wenn keine deutschen Texte übernommen werden sollen","Replace by an invalid language key if German descriptions are not wanted","Sprache 1:","DEU","durch ungültigen Sprachschlüssel ersetzen, wenn keine deutschen Texte übernommen werden sollen","Replace by an invalid language key if German descriptions are not wanted","Sprache 1:","DEU","durch ungültigen Sprachschlüssel ersetzen, wenn keine deutschen Texte übernommen werden sollen","Replace by an invalid language key if German descriptions are not wanted","Sprache 1:","DEU","durch ungültigen Sprachschlüssel ersetzen, wenn keine deutschen Texte übernommen werden sollen","Replace by an invalid language key if German descriptions are not wanted","Sprache 1:","DEU","durch ungültigen Sprachschlüssel ersetzen, wenn keine deutschen Texte übernommen werden sollen","Replace by an invalid language key if German descriptions are not wanted","Sprache 1:","DEU","durch ungültigen Sprachschlüssel ersetzen, wenn keine deutschen Texte übernommen werden sollen","Replace by an invalid language key if German descriptions are not wanted","Sprache 1:","DEU","durch ungültigen Sprachschlüssel ersetzen, wenn keine deutschen Texte übernommen werden sollen","Replace by an invalid language key if German descriptions are not wanted","Sprache 1:","DEU","durch ungültigen Sprachschlüssel ersetzen, wenn keine deutschen Texte übernommen werden sollen","Replace by an invalid language key if German descriptions are not wanted","Sprache 1:","DEU","durch ungültigen Sprachschlüssel ersetzen, wenn keine deutschen Texte übernommen werden sollen","Replace by an invalid language key if German descriptions are not wanted","Sprache 1:","DEU","durch ungültigen Sprachschlüssel ersetzen, wenn keine deutschen Texte übernommen werden sollen","Replace by an invalid language key if German descriptions are not wanted","Sprache 1:","DEU","durch ungültigen Sprachschlüssel ersetzen, wenn keine deutschen Texte übernommen werden sollen","Replace by an invalid language key if German descriptions are not wanted","Sprache 1:","DEU","durch ungültigen Sprachschlüssel ersetzen, wenn keine deutschen Texte übernommen werden sollen","Replace by an invalid language key if German descriptions are not wanted","Sprache 1:","DEU","durch ungültigen Sprachschlüssel ersetzen, wenn keine deutschen Texte übernommen werden sollen","Replace by an invalid language key if German descriptions are not wanted","Sprache 1:","DEU","durch ungültigen Sprachschlüssel ersetzen, wenn keine deutschen Texte übernommen werden sollen","Replace by an invalid language key if German descriptions are not wanted","Sprache 1:","DEU","durch ungültigen Sprachschlüssel ersetzen, wenn keine deutschen Texte übernommen werden sollen","Replace by an invalid language key if German descriptions are not wanted","Sprache 1:","DEU","durch ungültigen Sprachschlüssel ersetzen, wenn keine deutschen Texte übernommen werden sollen","Replace by an invalid language key if German descriptions are not wanted","Sprache 1:","DEU","durch ungültigen Sprachschlüssel ersetzen, wenn keine deutschen Texte übernommen werden sollen","Replace by an invalid language key if German descriptions are not wanted","Sprache 1:","DEU","durch ungültigen Sprachschlüssel ersetzen, wenn keine deutschen Texte übernommen werden sollen","Replace by an invalid language key if German descriptions are not wanted","Sprache 1:","DEU","durch ungültigen Sprachschlüssel ersetzen, wenn keine deutschen Texte übernommen werden sollen","Replace by an invalid language key if German descriptions are not wanted","Sprache 1:","DEU","durch ungültigen Sprachschlüssel ersetzen, wenn keine deutschen Texte übernommen werden sollen","Replace by an invalid language key if German descriptions are not wanted","Sprache 1:","DEU","durch ungültigen Sprachschlüssel ersetzen, wenn keine deutschen Texte übernommen werden sollen","Replace by an invalid language key if German descriptions are not wanted","Sprache 1:","DEU","durch ungültigen Sprachschlüssel ersetzen, wenn keine deutschen Texte übernommen werden sollen","Replace by an invalid language key if German descriptions are not wanted","Sprache 1:","DEU","durch ungültigen Sprachschlüssel ersetzen, wenn keine deutschen Texte übernommen werden sollen","Replace by an invalid language key if German descriptions are not wanted","Sprache 1:","DEU","durch ungültigen Sprachschlüssel ersetzen, wenn keine deutschen Texte übernommen werden sollen","Replace by an invalid language key if German descriptions are not wanted","Sprache 1:","DEU","durch ungültigen Sprachschlüssel ersetzen, wenn keine deutschen Texte übernommen werden sollen","Replace by an invalid language key if German descriptions are not wanted","Sprache 1:","DEU","durch ungültigen Sprachschlüssel ersetzen, wenn keine deutschen Texte übernommen werden sollen","Replace by an invalid language key if German descriptions are not wanted","Sprache 1:","DEU","durch ungültigen Sprachschlüssel ersetzen, wenn keine deutschen Texte übernommen werden sollen","Replace by an invalid language key if German descriptions are not wanted","Sprache 1:","DEU","durch ungültigen Sprachschlüssel ersetzen, wenn keine deutschen Texte übernommen werden sollen","Replace by an invalid language key if German descriptions are not wanted","Sprache 1:","DEU","durch ungültigen Sprachschlüssel ersetzen, wenn keine deutschen Texte übernommen werden sollen","Replace by an invalid language key if German descriptions are not wanted","Sprache 1:","DEU","durch ungültigen Sprachschlüssel ersetzen, wenn keine deutschen Texte übernommen werden sollen","Replace by an invalid language key if German descriptions are not wanted","Sprache 1:","DEU","durch ungültigen Sprachschlüssel ersetzen, wenn keine deutschen Texte übernommen werden sollen","Replace by an invalid language key if German descriptions are not wanted","Sprache 1:","DEU","durch ungültigen Sprachschlüssel ersetzen, wenn keine deutschen Texte übernommen werden sollen","Replace by an invalid language key if German descriptions are not wanted","Sprache 1:","DEU","durch ungültigen Sprachschlüssel ersetzen, wenn keine deutschen Texte übernommen werden sollen","Replace by an invalid language key if German descriptions are not wanted","Sprache 1:","DEU","durch ungültigen Sprachschlüssel ersetzen, wenn keine deutschen Texte übernommen werden sollen","Replace by an invalid language key if German descriptions are not wanted","Sprache 1:","DEU","durch ungültigen Sprachschlüssel ersetzen, wenn keine deutschen Texte übernommen werden sollen","Replace by an invalid language key if German descriptions are not wanted","Sprache 1:","DEU","durch ungültigen Sprachschlüssel ersetzen, wenn keine deutschen Texte übernommen werden sollen","Replace by an invalid language key if German descriptions are not wanted","Sprache 1:","DEU","durch ungültigen Sprachschlüssel ersetzen, wenn keine deutschen Texte übernommen werden sollen","Replace by an invalid language key if German descriptions are not wanted","Sprache 1:","DEU","durch ungültigen Sprachschlüssel ersetzen, wenn keine deutschen Texte übernommen werden sollen","Replace by an invalid language key if German descriptions are not wanted","Sprache 1:","DEU","durch ungültigen Sprachschlüssel ersetzen, wenn keine deutschen Texte übernommen werden sollen","Replace by an invalid language key if German descriptions are not wanted","Sprache 1:","DEU","durch ungültigen Sprachschlüssel ersetzen, wenn keine deutschen Texte übernommen werden sollen","Replace by an invalid language key if German descriptions are not wanted","Sprache 1:","DEU","durch ungültigen Sprachschlüssel ersetzen, wenn keine deutschen Texte übernommen werden sollen","Replace by an invalid language key if German descriptions are not wanted","Sprache 1:","DEU","durch ungültigen Sprachschlüssel ersetzen, wenn keine deutschen Texte übernommen werden sollen","Replace by an invalid language key if German descriptions are not wanted","Sprache 1:","DEU","durch ungültigen Sprachschlüssel ersetzen, wenn keine deutschen Texte übernommen werden sollen","Replace by an invalid language key if German descriptions are not wanted","Sprache 1:","DEU","durch ungültigen Sprachschlüssel ersetzen, wenn keine deutschen Texte übernommen werden sollen","Replace by an invalid language key if German descriptions are not wanted","Sprache 1:","DEU","durch ungültigen Sprachschlüssel ersetzen, wenn keine deutschen Texte übernommen werden sollen","Replace by an invalid language key if German descriptions are not wanted","Sprache 1:","DEU","durch ungültigen Sprachschlüssel ersetzen, wenn keine deutschen Texte übernommen werden sollen","Replace by an invalid language key if German descriptions are not wanted","Sprache 1:","DEU","durch ungültigen Sprachschlüssel ersetzen, wenn keine deutschen Texte übernommen werden sollen","Replace by an invalid language key if German descriptions are not wanted","Sprache 1:","DEU","durch ungültigen Sprachschlüssel ersetzen, wenn keine deutschen Texte übernommen werden sollen","Replace by an invalid language key if German descriptions are not wanted","Sprache 1:","DEU","durch ungültigen Sprachschlüssel ersetzen, wenn keine deutschen Texte übernommen werden sollen","Replace by an invalid language key if German descriptions are not wanted","Sprache 1:","DEU","durch ungültigen Sprachschlüssel ersetzen, wenn keine deutschen Texte übernommen werden sollen","Replace by an invalid language key if German descriptions are not wanted","Sprache 1:","DEU","durch ungültigen Sprachschlüssel ersetzen, wenn keine deutschen Texte übernommen werden sollen","Replace by an invalid language key if German descriptions are not wanted","Sprache 1:","DEU","durch ungültigen Sprachschlüssel ersetzen, wenn keine deutschen Texte übernommen werden sollen","Replace by an invalid language key if German descriptions are not wanted","Sprache 1:","DEU","durch ungültigen Sprachschlüssel ersetzen, wenn keine deutschen Texte übernommen werden sollen","Replace by an invalid language key if German descriptions are not wanted","Sprache 1:","DEU","durch ungültigen Sprachschlüssel ersetzen, wenn keine deutschen Texte übernommen werden sollen","Replace by an invalid language key if German descriptions are not wanted","Sprache 1:","DEU","durch ungültigen Sprachschlüssel ersetzen, wenn keine deutschen Texte übernommen werden sollen","Replace by an invalid language key if German descriptions are not wanted","Sprache 1:","DEU","durch ungültigen Sprachschlüssel ersetzen, wenn keine deutschen Texte übernommen werden sollen","Replace by an invalid language key if German descriptions are not wanted","Sprache 1:","DEU","durch ungültigen Sprachschlüssel ersetzen, wenn keine deutschen Texte übernommen werden sollen","Replace by an invalid language key if German descriptions are not wanted","Sprache 1:","DEU","durch ungültigen Sprachschlüssel ersetzen, wenn keine deutschen Texte übernommen werden sollen","Replace by an invalid language key if German descriptions are not wanted","Sprache 1:","DEU","durch ungültigen Sprachschlüssel ersetzen, wenn keine deutschen Texte übernommen werden sollen","Replace by an invalid language key if German descriptions are not wanted","Sprache 1:","DEU","durch ungültigen Sprachschlüssel ersetzen, wenn keine deutschen Texte übernommen werden sollen","Replace by an invalid language key if German descriptions are not wanted","Sprache 1:","DEU","durch ungültigen Sprachschlüssel ersetzen, wenn keine deutschen Texte übernommen werden sollen","Replace by an invalid language key if German descriptions are not wanted","Sprache 1:","DEU","durch ungültigen Sprachschlüssel ersetzen, wenn keine deutschen Texte übernommen werden sollen","Replace by an invalid language key if German descriptions are not wanted","Sprache 1:","DEU","durch ungültigen Sprachschlüssel ersetzen, wenn keine deutschen Texte übernommen werden sollen","Replace by an invalid language key if German descriptions are not wanted","Sprache 1:","DEU","durch ungültigen Sprachschlüssel ersetzen, wenn keine deutschen Texte übernommen werden sollen","Replace by an invalid language key if German descriptions are not wanted","Sprache 1:","DEU","durch ungültigen Sprachschlüssel ersetzen, wenn keine deutschen Texte übernommen werden sollen","Replace by an invalid language key if German descriptions are not wanted","Sprache 1:","DEU","durch ungültigen Sprachschlüssel ersetzen, wenn keine deutschen Texte übernommen werden sollen","Replace by an invalid language key if German descriptions are not wanted","Sprache 1:","DEU","durch ungültigen Sprachschlüssel ersetzen, wenn keine deutschen Texte übernommen werden sollen","Replace by an invalid language key if German descriptions are not wanted","Sprache 1:","DEU","durch ungültigen Sprachschlüssel ersetzen, wenn keine deutschen Texte übernommen werden sollen","Replace by an invalid language key if German descriptions are not wanted","Sprache 1:","DEU","durch ungültigen Sprachschlüssel ersetzen, wenn keine deutschen Texte übernommen werden sollen","Replace by an invalid language key if German descriptions are not wanted","Sprache 1:","DEU","durch ungültigen Sprachschlüssel ersetzen, wenn keine deutschen Texte übernommen werden sollen","Replace by an invalid language key if German descriptions are not wanted","Sprache 1:","DEU","durch ungültigen Sprachschlüssel ersetzen, wenn keine deutschen Texte übernommen werden sollen","Replace by an invalid language key if German descriptions are not wanted","Sprache 1:","DEU","durch ungültigen Sprachschlüssel ersetzen, wenn keine deutschen Texte übernommen werden sollen","Replace by an invalid language key if German descriptions are not wanted","Sprache 1:","DEU","durch ungültigen Sprachschlüssel ersetzen, wenn keine deutschen Texte übernommen werden sollen","Replace by an invalid language key if German descriptions are not wanted","Sprache 1:","DEU","durch ungültigen Sprachschlüssel ersetzen, wenn keine deutschen Texte übernommen werden sollen","Replace by an invalid language key if German descriptions are not wanted","Sprache 1:","DEU","durch ungültigen Sprachschlüssel ersetzen, wenn keine deutschen Texte übernommen werden sollen","Replace by an invalid language key if German descriptions are not wanted","Sprache 1:","DEU","durch ungültigen Sprachschlüssel ersetzen, wenn keine deutschen Texte übernommen werden sollen","Replace by an invalid language key if German descriptions are not wanted","Sprache 1:","DEU","durch ungültigen Sprachschlüssel ersetzen, wenn keine deutschen Texte übernommen werden sollen","Replace by an invalid language key if German descriptions are not wanted","Sprache 1:","DEU","durch ungültigen Sprachschlüssel ersetzen, wenn keine deutschen Texte übernommen werden sollen","Replace by an invalid language key if German descriptions are not wanted","Sprache 1:","DEU","durch ungültigen Sprachschlüssel ersetzen, wenn keine deutschen Texte übernommen werden sollen","Replace by an invalid language key if German descriptions are not wanted","Sprache 1:","DEU","durch ungültigen Sprachschlüssel ersetzen, wenn keine deutschen Texte übernommen werden sollen","Replace by an invalid language key if German descriptions are not wanted","Sprache 1:","DEU","durch ungültigen Sprachschlüssel ersetzen, wenn keine deutschen Texte übernommen werden sollen","Replace by an invalid language key if German descriptions are not wanted","Sprache 1:","DEU","durch ungültigen Sprachschlüssel ersetzen, wenn keine deutschen Texte übernommen werden sollen","Replace by an invalid language key if German descriptions are not wanted","Sprache 1:","DEU","durch ungültigen Sprachschlüssel ersetzen, wenn keine deutschen Texte übernommen werden sollen","Replace by an invalid language key if German descriptions are not wanted","Sprache 1:","DEU","durch ungültigen Sprachschlüssel ersetzen, wenn keine deutschen Texte übernommen werden sollen","Replace by an invalid language key if German descriptions are not wanted","Sprache 1:","DEU","durch ungültigen Sprachschlüssel ersetzen, wenn keine deutschen Texte übernommen werden sollen","Replace by an invalid language key if German descriptions are not wanted","Sprache 1:","DEU","durch ungültigen Sprachschlüssel ersetzen, wenn keine deutschen Texte übernommen werden sollen","Replace by an invalid language key if German descriptions are not wanted","Sprache 1:","DEU","durch ungültigen Sprachschlüssel ersetzen, wenn keine deutschen Texte übernommen werden sollen","Replace by an invalid language key if German descriptions are not wanted","Sprache 1:","DEU","durch ungültigen Sprachschlüssel ersetzen, wenn keine deutschen Texte übernommen werden sollen","Replace by an invalid language key if German descriptions are not wanted","Sprache 1:","DEU","durch ungültigen Sprachschlüssel ersetzen, wenn keine deutschen Texte übernommen werden sollen","Replace by an invalid language key if German descriptions are not wanted","Sprache 1:","DEU","durch ungültigen Sprachschlüssel ersetzen, wenn keine deutschen Texte übernommen werden sollen","Replace by an invalid language key if German descriptions are not wanted","Sprache 1:","DEU","durch ungültigen Sprachschlüssel ersetzen, wenn keine deutschen Texte übernommen werden sollen","Replace by an invalid language key if German descriptions are not wanted","Sprache 1:","DEU","durch ungültigen Sprachschlüssel ersetzen, wenn keine deutschen Texte übernommen werden sollen","Replace by an invalid language key if German descriptions are not wanted","Sprache 1:","DEU","durch ungültigen Sprachschlüssel ersetzen, wenn keine deutschen Texte übernommen werden sollen","Replace by an invalid language key if German descriptions are not wanted","Sprache 1:","DEU","durch ungültigen Sprachschlüssel ersetzen, wenn keine deutschen Texte übernommen werden sollen","Replace by an invalid language key if German descriptions are not wanted","Sprache 1:","DEU","durch ungültigen Sprachschlüssel ersetzen, wenn keine deutschen Texte übernommen werden sollen","Replace by an invalid language key if German descriptions are not wanted","Sprache 1:","DEU","durch ungültigen Sprachschlüssel ersetzen, wenn keine deutschen Texte übernommen werden sollen","Replace by an invalid language key if German descriptions are not wanted","Sprache 1:","DEU","durch ungültigen Sprachschlüssel ersetzen, wenn keine deutschen Texte übernommen werden sollen","Replace by an invalid language key if German descriptions are not wanted","Sprache 1:","DEU","durch ungültigen Sprachschlüssel ersetzen, wenn keine deutschen Texte übernommen werden sollen","Replace by an invalid language key if German descriptions are not wanted","Sprache 1:","DEU","durch ungültigen Sprachschlüssel ersetzen, wenn keine deutschen Texte übernommen werden sollen","Replace by an invalid language key if German descriptions are not wanted","Sprache 1:","DEU","durch ungültigen Sprachschlüssel ersetzen, wenn keine deutschen Texte übernommen werden sollen","Replace by an invalid language key if German descriptions are not wanted","Sprache 1:","DEU","durch ungültigen Sprachschlüssel ersetzen, wenn keine deutschen Texte übernommen werden sollen","Replace by an invalid language key if German descriptions are not wanted","Sprache 1:","DEU","durch ungültigen Sprachschlüssel ersetzen, wenn keine deutschen Texte übernommen werden sollen","Replace by an invalid language key if German descriptions are not wanted","Sprache 1:","DEU","durch ungültigen Sprachschlüssel ersetzen, wenn keine deutschen Texte übernommen werden sollen","Replace by an invalid language key if German descriptions are not wanted","Sprache 1:","DEU","durch ungültigen Sprachschlüssel ersetzen, wenn keine deutschen Texte übernommen werden sollen","Replace by an invalid language key if German descriptions are not wanted","Sprache 1:","DEU","durch ungültigen Sprachschlüssel ersetzen, wenn keine deutschen Texte übernommen werden sollen","Replace by an invalid language key if German descriptions are not wanted","Sprache 1:","DEU","durch ungültigen Sprachschlüssel ersetzen, wenn keine deutschen Texte übernommen werden sollen","Replace by an invalid language key if German descriptions are not wanted","Sprache 1:","DEU","durch ungültigen Sprachschlüssel ersetzen, wenn keine deutschen Texte übernommen werden sollen","Replace by an invalid language key if German descriptions are not wanted","Sprache 1:","DEU","durch ungültigen Sprachschlüssel ersetzen, wenn keine deutschen Texte übernommen werden sollen","Replace by an invalid language key if German descriptions are not wanted","Sprache 1:","DEU","durch ungültigen Sprachschlüssel ersetzen, wenn keine deutschen Texte übernommen werden sollen","Replace by an invalid language key if German descriptions are not wanted","Sprache 1:","DEU","durch ungültigen Sprachschlüssel ersetzen, wenn keine deutschen Texte übernommen werden sollen","Replace by an invalid language key if German descriptions are not wanted","Sprache 1:","DEU","durch ungültigen Sprachschlüssel ersetzen, wenn keine deutschen Texte übernommen werden sollen","Replace by an invalid language key if German descriptions are not wanted","Sprache 1:","DEU","durch ungültigen Sprachschlüssel ersetzen, wenn keine deutschen Texte übernommen werden sollen","Replace by an invalid language key if German descriptions are not wanted","Sprache 1:","DEU","durch ungültigen Sprachschlüssel ersetzen, wenn keine deutschen Texte übernommen werden sollen","Replace by an invalid language key if German descriptions are not wanted","Sprache 1:","DEU","durch ungültigen Sprachschlüssel ersetzen, wenn keine deutschen Texte übernommen werden sollen","Replace by an invalid language key if German descriptions are not wanted","Sprache 1:","DEU","durch ungültigen Sprachschlüssel ersetzen, wenn keine deutschen Texte übernommen werden sollen","Replace by an invalid language key if German descriptions are not wanted","Sprache 1:","DEU","durch ungültigen Sprachschlüssel ersetzen, wenn keine deutschen Texte übernommen werden sollen","Replace by an invalid language key if German descriptions are not wanted","Sprache 1:","DEU","durch ungültigen Sprachschlüssel ersetzen, wenn keine deutschen Texte übernommen werden sollen","Replace by an invalid language key if German descriptions are not wanted","Sprache 1:","DEU","durch ungültigen Sprachschlüssel ersetzen, wenn keine deutschen Texte übernommen werden sollen","Replace by an invalid language key if German descriptions are not wanted","Sprache 1:","DEU","durch ungültigen Sprachschlüssel ersetzen, wenn keine deutschen Texte übernommen werden sollen","Replace by an invalid language key if German descriptions are not wanted","Sprache 1:","DEU","durch ungültigen Sprachschlüssel ersetzen, wenn keine deutschen Texte übernommen werden sollen","Replace by an invalid language key if German descriptions are not wanted","Sprache 1:","DEU","durch ungültigen Sprachschlüssel ersetzen, wenn keine deutschen Texte übernommen werden sollen","Replace by an invalid language key if German descriptions are not wanted","Sprache 1:","DEU","durch ungültigen Sprachschlüssel ersetzen, wenn keine deutschen Texte übernommen werden sollen","Replace by an invalid language key if German descriptions are not wanted","Sprache 1:","DEU","durch ungültigen Sprachschlüssel ersetzen, wenn keine deutschen Texte übernommen werden sollen","Replace by an invalid language key if German descriptions are not wanted","Sprache 1:","DEU","durch ungültigen Sprachschlüssel ersetzen, wenn keine deutschen Texte übernommen werden sollen","Replace by an invalid language key if German descriptions are not wanted","Sprache 1:","DEU","durch ungültigen Sprachschlüssel ersetzen, wenn keine deutschen Texte übernommen werden sollen","Replace by an invalid language key if German descriptions are not wanted","Sprache 1:","DEU","durch ungültigen Sprachschlüssel ersetzen, wenn keine deutschen Texte übernommen werden sollen","Replace by an invalid language key if German descriptions are not wanted","Sprache 1:","DEU","durch ungültigen Sprachschlüssel ersetzen, wenn keine deutschen Texte übernommen werden sollen","Replace by an invalid language key if German descriptions are not wanted","Sprache 1:","DEU","durch ungültigen Sprachschlüssel ersetzen, wenn keine deutschen Texte übernommen werden sollen","Replace by an invalid language key if German descriptions are not wanted","Sprache 1:","DEU","durch ungültigen Sprachschlüssel ersetzen, wenn keine deutschen Texte übernommen werden sollen","Replace by an invalid language key if German descriptions are not wanted","Sprache 1:","DEU","durch ungültigen Sprachschlüssel ersetzen, wenn keine deutschen Texte übernommen werden sollen","Replace by an invalid language key if German descriptions are not wanted","Sprache 1:","DEU","durch ungültigen Sprachschlüssel ersetzen, wenn keine deutschen Texte übernommen werden sollen","Replace by an invalid language key if German descriptions are not wanted","Sprache 1:","DEU","durch ungültigen Sprachschlüssel ersetzen, wenn keine deutschen Texte übernommen werden sollen","Replace by an invalid language key if German descriptions are not wanted","Sprache 1:","DEU","durch ungültigen Sprachschlüssel ersetzen, wenn keine deutschen Texte übernommen werden sollen","Replace by an invalid language key if German descriptions are not wanted","Sprache 1:","DEU","durch ungültigen Sprachschlüssel ersetzen, wenn keine deutschen Texte übernommen werden sollen","Replace by an invalid language key if German descriptions are not wanted","Sprache 1:","DEU","durch ungültigen Sprachschlüssel ersetzen, wenn keine deutschen Texte übernommen werden sollen","Replace by an invalid language key if German descriptions are not wanted","Sprache 1:","DEU","durch ungültigen Sprachschlüssel ersetzen, wenn keine deutschen Texte übernommen werden sollen","Replace by an invalid language key if German descriptions are not wanted","Sprache 1:","DEU","durch ungültigen Sprachschlüssel ersetzen, wenn keine deutschen Texte übernommen werden sollen","Replace by an invalid language key if German descriptions are not wanted","Sprache 1:","DEU","durch ungültigen Sprachschlüssel ersetzen, wenn keine deutschen Texte übernommen werden sollen","Replace by an invalid language key if German descriptions are not wanted","Sprache 1:","DEU","durch ungültigen Sprachschlüssel ersetzen, wenn keine deutschen Texte übernommen werden sollen","Replace by an invalid language key if German descriptions are not wanted","Sprache 1:","DEU","durch ungültigen Sprachschlüssel ersetzen, wenn keine deutschen Texte übernommen werden sollen","Replace by an invalid language key if German descriptions are not wanted","Sprache 1:","DEU","durch ungültigen Sprachschlüssel ersetzen, wenn keine deutschen Texte übernommen werden sollen","Replace by an invalid language key if German descriptions are not wanted","Sprache 1:","DEU","durch ungültigen Sprachschlüssel ersetzen, wenn keine deutschen Texte übernommen werden sollen","Replace by an invalid language key if German descriptions are not wanted","Sprache 1:","DEU","durch ungültigen Sprachschlüssel ersetzen, wenn keine deutschen Texte übernommen werden sollen","Replace by an invalid language key if German descriptions are not wanted","Sprache 1:","DEU","durch ungültigen Sprachschlüssel ersetzen, wenn keine deutschen Texte übernommen werden sollen","Replace by an invalid language key if German descriptions are not wanted","Sprache 1:","DEU","durch ungültigen Sprachschlüssel ersetzen, wenn keine deutschen Texte übernommen werden sollen","Replace by an invalid language key if German descriptions are not wanted","Sprache 1:","DEU","durch ungültigen Sprachschlüssel ersetzen, wenn keine deutschen Texte übernommen werden sollen","Replace by an invalid language key if German descriptions are not wanted","Sprache 1:","DEU","durch ungültigen Sprachschlüssel ersetzen, wenn keine deutschen Texte übernommen werden sollen","Replace by an invalid language key if German descriptions are not wanted","Sprache 1:","DEU","durch ungültigen Sprachschlüssel ersetzen, wenn keine deutschen Texte übernommen werden sollen","Replace by an invalid language key if German descriptions are not wanted","Sprache 1:","DEU","durch ungültigen Sprachschlüssel ersetzen, wenn keine deutschen Texte übernommen werden sollen","Replace by an invalid language key if German descriptions are not wanted","Sprache 1:","DEU","durch ungültigen Sprachschlüssel ersetzen, wenn keine deutschen Texte übernommen werden sollen","Replace by an invalid language key if German descriptions are not wanted","Sprache 1:","DEU","durch ungültigen Sprachschlüssel ersetzen, wenn keine deutschen Texte übernommen werden sollen","Replace by an invalid language key if German descriptions are not wanted","Sprache 1:","DEU","durch ungültigen Sprachschlüssel ersetzen, wenn keine deutschen Texte übernommen werden sollen","Replace by an invalid language key if German descriptions are not wanted","Sprache 1:","DEU","durch ungültigen Sprachschlüssel ersetzen, wenn keine deutschen Texte übernommen werden sollen","Replace by an invalid language key if German descriptions are not wanted","Sprache 1:","DEU","durch ungültigen Sprachschlüssel ersetzen, wenn keine deutschen Texte übernommen werden sollen","Replace by an invalid language key if German descriptions are not wanted","Sprache 1:","DEU","durch ungültigen Sprachschlüssel ersetzen, wenn keine deutschen Texte übernommen werden sollen","Replace by an invalid language key if German descriptions are not wanted","Sprache 1:","DEU","durch ungültigen Sprachschlüssel ersetzen, wenn keine deutschen Texte übernommen werden sollen","Replace by an invalid language key if German descriptions are not wanted","Sprache 1:","DEU","durch ungültigen Sprachschlüssel ersetzen, wenn keine deutschen Texte übernommen werden sollen","Replace by an invalid language key if German descriptions are not wanted","Sprache 1:","DEU","durch ungültigen Sprachschlüssel ersetzen, wenn keine deutschen Texte übernommen werden sollen","Replace by an invalid language key if German descriptions are not wanted","Sprache 1:","DEU","durch ungültigen Sprachschlüssel ersetzen, wenn keine deutschen Texte übernommen werden sollen","Replace by an invalid language key if German descriptions are not wanted","Sprache 1:","DEU","durch ungültigen Sprachschlüssel ersetzen, wenn keine deutschen Texte übernommen werden sollen","Replace by an invalid language key if German descriptions are not wanted","Sprache 1:","DEU","durch ungültigen Sprachschlüssel ersetzen, wenn keine deutschen Texte übernommen werden sollen","Replace by an invalid language key if German descriptions are not wanted","Sprache 1:","DEU","durch ungültigen Sprachschlüssel ersetzen, wenn keine deutschen Texte übernommen werden sollen","Replace by an invalid language key if German descriptions are not wanted","Sprache 1:","DEU","durch ungültigen Sprachschlüssel ersetzen, wenn keine deutschen Texte übernommen werden sollen","Replace by an invalid language key if German descriptions are not wanted","Sprache 1:","DEU","durch ungültigen Sprachschlüssel ersetzen, wenn keine deutschen Texte übernommen werden sollen","Replace by an invalid language key if German descriptions are not wanted","Sprache 1:","DEU","durch ungültigen Sprachschlüssel ersetzen, wenn keine deutschen Texte übernommen werden sollen","Replace by an invalid language key if German descriptions are not wanted","Sprache 1:","DEU","durch ungültigen Sprachschlüssel ersetzen, wenn keine deutschen Texte übernommen werden sollen","Replace by an invalid language key if German descriptions are not wanted","Sprache 1:","DEU","durch ungültigen Sprachschlüssel ersetzen, wenn keine deutschen Texte übernommen werden sollen","Replace by an invalid language key if German descriptions are not wanted","Sprache 1:","DEU","durch ungültigen Sprachschlüssel ersetzen, wenn keine deutschen Texte übernommen werden sollen","Replace by an invalid language key if German descriptions are not wanted","Sprache 1:","DEU","durch ungültigen Sprachschlüssel ersetzen, wenn keine deutschen Texte übernommen werden sollen","Replace by an invalid language key if German descriptions are not wanted","Sprache 1:","DEU","durch ungültigen Sprachschlüssel ersetzen, wenn keine deutschen Texte übernommen werden sollen","Replace by an invalid language key if German descriptions are not wanted","Sprache 1:","DEU","durch ungültigen Sprachschlüssel ersetzen, wenn keine deutschen Texte übernommen werden sollen","Replace by an invalid language key if German descriptions are not wanted","Sprache 1:","DEU","durch ungültigen Sprachschlüssel ersetzen, wenn keine deutschen Texte übernommen werden sollen","Replace by an invalid language key if German descriptions are not wanted","Sprache 1:","DEU","durch ungültigen Sprachschlüssel ersetzen, wenn keine deutschen Texte übernommen werden sollen","Replace by an invalid language key if German descriptions are not wanted","Sprache 1:","DEU","durch ungültigen Sprachschlüssel ersetzen, wenn keine deutschen Texte übernommen werden sollen","Replace by an invalid language key if German descriptions are not wanted","Sprache 1:","DEU","durch ungültigen Sprachschlüssel ersetzen, wenn keine deutschen Texte übernommen werden sollen","Replace by an invalid language key if German descriptions are not wanted","Sprache 1:","DEU","durch ungültigen Sprachschlüssel ersetzen, wenn keine deutschen Texte übernommen werden sollen","Replace by an invalid language key if German descriptions are not wanted","Sprache 1:","DEU","durch ungültigen Sprachschlüssel ersetzen, wenn keine deutschen Texte übernommen werden sollen","Replace by an invalid language key if German descriptions are not wanted","Sprache 1:","DEU","durch ungültigen Sprachschlüssel ersetzen, wenn keine deutschen Texte übernommen werden sollen","Replace by an invalid language key if German descriptions are not wanted","Sprache 1:","DEU","durch ungültigen Sprachschlüssel ersetzen, wenn keine deutschen Texte übernommen werden sollen","Replace by an invalid language key if German descriptions are not wanted","Sprache 1:","DEU","durch ungültigen Sprachschlüssel ersetzen, wenn keine deutschen Texte übernommen werden sollen","Replace by an invalid language key if German descriptions are not wanted","Sprache 1:","DEU","durch ungültigen Sprachschlüssel ersetzen, wenn keine deutschen Texte übernommen werden sollen","Replace by an invalid language key if German descriptions are not wanted","Sprache 1:","DEU","durch ungültigen Sprachschlüssel ersetzen, wenn keine deutschen Texte übernommen werden sollen","Replace by an invalid language key if German descriptions are not wanted","Sprache 1:","DEU","durch ungültigen Sprachschlüssel ersetzen, wenn keine deutschen Texte übernommen werden sollen","Replace by an invalid language key if German descriptions are not wanted","Sprache 1:","DEU","durch ungültigen Sprachschlüssel ersetzen, wenn keine deutschen Texte übernommen werden sollen","Replace by an invalid language key if German descriptions are not wanted","Sprache 1:","DEU","durch ungültigen Sprachschlüssel ersetzen, wenn keine deutschen Texte übernommen werden sollen","Replace by an invalid language key if German descriptions are not wanted","Sprache 1:","DEU","durch ungültigen Sprachschlüssel ersetzen, wenn keine deutschen Texte übernommen werden sollen","Replace by an invalid language key if German descriptions are not wanted","Sprache 1:","DEU","durch ungültigen Sprachschlüssel ersetzen, wenn keine deutschen Texte übernommen werden sollen","Replace by an invalid language key if German descriptions are not wanted","Sprache 1:","DEU","durch ungültigen Sprachschlüssel ersetzen, wenn keine deutschen Texte übernommen werden sollen","Replace by an invalid language key if German descriptions are not wanted","Sprache 1:","DEU","durch ungültigen Sprachschlüssel ersetzen, wenn keine deutschen Texte übernommen werden sollen","Replace by an invalid language key if German descriptions are not wanted","Sprache 1:","DEU","durch ungültigen Sprachschlüssel ersetzen, wenn keine deutschen Texte übernommen werden sollen","Replace by an invalid language key if German descriptions are not wanted","Sprache 1:","DEU","durch ungültigen Sprachschlüssel ersetzen, wenn keine deutschen Texte übernommen werden sollen","Replace by an invalid language key if German descriptions are not wanted","Sprache 1:","DEU","durch ungültigen Sprachschlüssel ersetzen, wenn keine deutschen Texte übernommen werden sollen","Replace by an invalid language key if German descriptions are not wanted","Sprache 1:","DEU","durch ungültigen Sprachschlüssel ersetzen, wenn keine deutschen Texte übernommen werden sollen","Replace by an invalid language key if German descriptions are not wanted","Sprache 1:","DEU","durch ungültigen Sprachschlüssel ersetzen, wenn keine deutschen Texte übernommen werden sollen","Replace by an invalid language key if German descriptions are not wanted","Sprache 1:","DEU","durch ungültigen Sprachschlüssel ersetzen, wenn keine deutschen Texte übernommen werden sollen","Replace by an invalid language key if German descriptions are not wanted","Sprache 1:","DEU","durch ungültigen Sprachschlüssel ersetzen, wenn keine deutschen Texte übernommen werden sollen","Replace by an invalid language key if German descriptions are not wanted","Sprache 1:","DEU","durch ungültigen Sprachschlüssel ersetzen, wenn keine deutschen Texte übernommen werden sollen","Replace by an invalid language key if German descriptions are not wanted","Sprache 1:","DEU","durch ungültigen Sprachschlüssel ersetzen, wenn keine deutschen Texte übernommen werden sollen","Replace by an invalid language key if German descriptions are not wanted","Sprache 1:","DEU","durch ungültigen Sprachschlüssel ersetzen, wenn keine deutschen Texte übernommen werden sollen","Replace by an invalid language key if German descriptions are not wanted","Sprache 1:","DEU","durch ungültigen Sprachschlüssel ersetzen, wenn keine deutschen Texte übernommen werden sollen","Replace by an invalid language key if German descriptions are not wanted","Sprache 1:","DEU","durch ungültigen Sprachschlüssel ersetzen, wenn keine deutschen Texte übernommen werden sollen","Replace by an invalid language key if German descriptions are not wanted","Sprache 1:","DEU","durch ungültigen Sprachschlüssel ersetzen, wenn keine deutschen Texte übernommen werden sollen","Replace by an invalid language key if German descriptions are not wanted","Sprache 1:","DEU","durch ungültigen Sprachschlüssel ersetzen, wenn keine deutschen Texte übernommen werden sollen","Replace by an invalid language key if German descriptions are not wanted","Sprache 1:","DEU","durch ungültigen Sprachschlüssel ersetzen, wenn keine deutschen Texte übernommen werden sollen","Replace by an invalid language key if German descriptions are not wanted","Sprache 1:","DEU","durch ungültigen Sprachschlüssel ersetzen, wenn keine deutschen Texte übernommen werden sollen","Replace by an invalid language key if German descriptions are not wanted","Sprache 1:","DEU","durch ungültigen Sprachschlüssel ersetzen, wenn keine deutschen Texte übernommen werden sollen","Replace by an invalid language key if German descriptions are not wanted","Sprache 1:","DEU","durch ungültigen Sprachschlüssel ersetzen, wenn keine deutschen Texte übernommen werden sollen","Replace by an invalid language key if German descriptions are not wanted","Sprache 1:","DEU","durch ungültigen Sprachschlüssel ersetzen, wenn keine deutschen Texte übernommen werden sollen","Replace by an invalid language key if German descriptions are not wanted","Sprache 1:","DEU","durch ungültigen Sprachschlüssel ersetzen, wenn keine deutschen Texte übernommen werden sollen","Replace by an invalid language key if German descriptions are not wanted","Sprache 1:","DEU","durch ungültigen Sprachschlüssel ersetzen, wenn keine deutschen Texte übernommen werden sollen","Replace by an invalid language key if German descriptions are not wanted","Sprache 1:","DEU","durch ungültigen Sprachschlüssel ersetzen, wenn keine deutschen Texte übernommen werden sollen","Replace by an invalid language key if German descriptions are not wanted","Sprache 1:","DEU","durch ungültigen Sprachschlüssel ersetzen, wenn keine deutschen Texte übernommen werden sollen","Replace by an invalid language key if German descriptions are not wanted","Sprache 1:","DEU","durch ungültigen Sprachschlüssel ersetzen, wenn keine deutschen Texte übernommen werden sollen","Replace by an invalid language key if German descriptions are not wanted","Sprache 1:","DEU","durch ungültigen Sprachschlüssel ersetzen, wenn keine deutschen Texte übernommen werden sollen","Replace by an invalid language key if German descriptions are not wanted","Sprache 1:","DEU","durch ungültigen Sprachschlüssel ersetzen, wenn keine deutschen Texte übernommen werden sollen","Replace by an invalid language key if German descriptions are not wanted","Sprache 1:","DEU","durch ungültigen Sprachschlüssel ersetzen, wenn keine deutschen Texte übernommen werden sollen","Replace by an invalid language key if German descriptions are not wanted","Sprache 1:","DEU","durch ungültigen Sprachschlüssel ersetzen, wenn keine deutschen Texte übernommen werden sollen","Replace by an invalid language key if German descriptions are not wanted","Sprache 1:","DEU","durch ungültigen Sprachschlüssel ersetzen, wenn keine deutschen Texte übernommen werden sollen","Replace by an invalid language key if German descriptions are not wanted","Sprache 1:","DEU","durch ungültigen Sprachschlüssel ersetzen, wenn keine deutschen Texte übernommen werden sollen","Replace by an invalid language key if German descriptions are not wanted","Sprache 1:","DEU","durch ungültigen Sprachschlüssel ersetzen, wenn keine deutschen Texte übernommen werden sollen","Replace by an invalid language key if German descriptions are not wanted","Sprache 1:","DEU","durch ungültigen Sprachschlüssel ersetzen, wenn keine deutschen Texte übernommen werden sollen","Replace by an invalid language key if German descriptions are not wanted","Sprache 1:","DEU","durch ungültigen Sprachschlüssel ersetzen, wenn keine deutschen Texte übernommen werden sollen","Replace by an invalid language key if German descriptions are not wanted","Sprache 1:","DEU","durch ungültigen Sprachschlüssel ersetzen, wenn keine deutschen Texte übernommen werden sollen","Replace by an invalid language key if German descriptions are not wanted","Sprache 1:","DEU","durch ungültigen Sprachschlüssel ersetzen, wenn keine deutschen Texte übernommen werden sollen","Replace by an invalid language key if German descriptions are not wanted","Sprache 1:","DEU","durch ungültigen Sprachschlüssel ersetzen, wenn keine deutschen Texte übernommen werden sollen","Replace by an invalid language key if German descriptions are not wanted","Sprache 1:","DEU","durch ungültigen Sprachschlüssel ersetzen, wenn keine deutschen Texte übernommen werden sollen","Replace by an invalid language key if German descriptions are not wanted","Sprache 1:","DEU","durch ungültigen Sprachschlüssel ersetzen, wenn keine deutschen Texte übernommen werden sollen","Replace by an invalid language key if German descriptions are not wanted","Sprache 1:","DEU","durch ungültigen Sprachschlüssel ersetzen, wenn keine deutschen Texte übernommen werden sollen","Replace by an invalid language key if German descriptions are not wanted","Sprache 1:","DEU","durch ungültigen Sprachschlüssel ersetzen, wenn keine deutschen Texte übernommen werden sollen","Replace by an invalid language key if German descriptions are not wanted","Sprache 1:","DEU","durch ungültigen Sprachschlüssel ersetzen, wenn keine deutschen Texte übernommen werden sollen","Replace by an invalid language key if German descriptions are not wanted","Sprache 1:","DEU","durch ungültigen Sprachschlüssel ersetzen, wenn keine deutschen Texte übernommen werden sollen","Replace by an invalid language key if German descriptions are not wanted","Sprache 1:","DEU","durch ungültigen Sprachschlüssel ersetzen, wenn keine deutschen Texte übernommen werden sollen","Replace by an invalid language key if German descriptions are not wanted","Sprache 1:","DEU","durch ungültigen Sprachschlüssel ersetzen, wenn keine deutschen Texte übernommen werden sollen","Replace by an invalid language key if German descriptions are not wanted","Sprache 1:","DEU","durch ungültigen Sprachschlüssel ersetzen, wenn keine deutschen Texte übernommen werden sollen","Replace by an invalid language key if German descriptions are not wanted","Sprache 1:","DEU","durch ungültigen Sprachschlüssel ersetzen, wenn keine deutschen Texte übernommen werden sollen","Replace by an invalid language key if German descriptions are not wanted","Sprache 1:","DEU","durch ungültigen Sprachschlüssel ersetzen, wenn keine deutschen Texte übernommen werden sollen","Replace by an invalid language key if German descriptions are not wanted","Sprache 1:","DEU","durch ungültigen Sprachschlüssel ersetzen, wenn keine deutschen Texte übernommen werden sollen","Replace by an invalid language key if German descriptions are not wanted","Sprache 1:","DEU","durch ungültigen Sprachschlüssel ersetzen, wenn keine deutschen Texte übernommen werden sollen","Replace by an invalid language key if German descriptions are not wanted","Sprache 1:","DEU","durch ungültigen Sprachschlüssel ersetzen, wenn keine deutschen Texte übernommen werden sollen","Replace by an invalid language key if German descriptions are not wanted","Sprache 1:","DEU","durch ungültigen Sprachschlüssel ersetzen, wenn keine deutschen Texte übernommen werden sollen","Replace by an invalid language key if German descriptions are not wanted","Sprache 1:","DEU","durch ungültigen Sprachschlüssel ersetzen, wenn keine deutschen Texte übernommen werden sollen","Replace by an invalid language key if German descriptions are not wanted","Sprache 1:","DEU","durch ungültigen Sprachschlüssel ersetzen, wenn keine deutschen Texte übernommen werden sollen","Replace by an invalid language key if German descriptions are not wanted","Sprache 1:","DEU","durch ungültigen Sprachschlüssel ersetzen, wenn keine deutschen Texte übernommen werden sollen","Replace by an invalid language key if German descriptions are not wanted","Sprache 1:","DEU","durch ungültigen Sprachschlüssel ersetzen, wenn keine deutschen Texte übernommen werden sollen","Replace by an invalid language key if German descriptions are not wanted","Sprache 1:","DEU","durch ungültigen Sprachschlüssel ersetzen, wenn keine deutschen Texte übernommen werden sollen","Replace by an invalid language key if German descriptions are not wanted","Sprache 1:","DEU","durch ungültigen Sprachschlüssel ersetzen, wenn keine deutschen Texte übernommen werden sollen","Replace by an invalid language key if German descriptions are not wanted","Sprache 1:","DEU","durch ungültigen Sprachschlüssel ersetzen, wenn keine deutschen Texte übernommen werden sollen","Replace by an invalid language key if German descriptions are not wanted","Sprache 1:","DEU","durch ungültigen Sprachschlüssel ersetzen, wenn keine deutschen Texte übernommen werden sollen","Replace by an invalid language key if German descriptions are not wanted","Sprache 1:","DEU","durch ungültigen Sprachschlüssel ersetzen, wenn keine deutschen Texte übernommen werden sollen","Replace by an invalid language key if German descriptions are not wanted","Sprache 1:","DEU","durch ungültigen Sprachschlüssel ersetzen, wenn keine deutschen Texte übernommen werden sollen","Replace by an invalid language key if German descriptions are not wanted","Sprache 1:","DEU","durch ungültigen Sprachschlüssel ersetzen, wenn keine deutschen Texte übernommen werden sollen","Replace by an invalid language key if German descriptions are not wanted","Sprache 1:","DEU","durch ungültigen Sprachschlüssel ersetzen, wenn keine deutschen Texte übernommen werden sollen","Replace by an invalid language key if German descriptions are not wanted","Sprache 1:","DEU","durch ungültigen Sprachschlüssel ersetzen, wenn keine deutschen Texte übernommen werden sollen","Replace by an invalid language key if German descriptions are not wanted","Sprache 1:","DEU","durch ungültigen Sprachschlüssel ersetzen, wenn keine deutschen Texte übernommen werden sollen","Replace by an invalid language key if German descriptions are not wanted","Sprache 1:","DEU","durch ungültigen Sprachschlüssel ersetzen, wenn keine deutschen Texte übernommen werden sollen","Replace by an invalid language key if German descriptions are not wanted","Sprache 1:","DEU","durch ungültigen Sprachschlüssel ersetzen, wenn keine deutschen Texte übernommen werden sollen","Replace by an invalid language key if German descriptions are not wanted","Sprache 1:","DEU","durch ungültigen Sprachschlüssel ersetzen, wenn keine deutschen Texte übernommen werden sollen","Replace by an invalid language key if German descriptions are not wanted","Sprache 1:","DEU","durch ungültigen Sprachschlüssel ersetzen, wenn keine deutschen Texte übernommen werden sollen","Replace by an invalid language key if German descriptions are not wanted","Sprache 1:","DEU","durch ungültigen Sprachschlüssel ersetzen, wenn keine deutschen Texte übernommen werden sollen","Replace by an invalid language key if German descriptions are not wanted","Sprache 1:","DEU","durch ungültigen Sprachschlüssel ersetzen, wenn keine deutschen Texte übernommen werden sollen","Replace by an invalid language key if German descriptions are not wanted","Sprache 1:","DEU","durch ungültigen Sprachschlüssel ersetzen, wenn keine deutschen Texte übernommen werden sollen","Replace by an invalid language key if German descriptions are not wanted","Sprache 1:","DEU","durch ungültigen Sprachschlüssel ersetzen, wenn keine deutschen Texte übernommen werden sollen","Replace by an invalid language key if German descriptions are not wanted","Sprache 1:","DEU","durch ungültigen Sprachschlüssel ersetzen, wenn keine deutschen Texte übernommen werden sollen","Replace by an invalid language key if German descriptions are not wanted","Sprache 1:","DEU","durch ungültigen Sprachschlüssel ersetzen, wenn keine deutschen Texte übernommen werden sollen","Replace by an invalid language key if German descriptions are not wanted","Sprache 1:","DEU","durch ungültigen Sprachschlüssel ersetzen, wenn keine deutschen Texte übernommen werden sollen","Replace by an invalid language key if German descriptions are not wanted","Sprache 1:","DEU","durch ungültigen Sprachschlüssel ersetzen, wenn keine deutschen Texte übernommen werden sollen","Replace by an invalid language key if German descriptions are not wanted","Sprache 1:","DEU","durch ungültigen Sprachschlüssel ersetzen, wenn keine deutschen Texte übernommen werden sollen","Replace by an invalid language key if German descriptions are not wanted","Sprache 1:","DEU","durch ungültigen Sprachschlüssel ersetzen, wenn keine deutschen Texte übernommen werden sollen","Replace by an invalid language key if German descriptions are not wanted","Sprache 1:","DEU","durch ungültigen Sprachschlüssel ersetzen, wenn keine deutschen Texte übernommen werden sollen","Replace by an invalid language key if German descriptions are not wanted","Sprache 1:","DEU","durch ungültigen Sprachschlüssel ersetzen, wenn keine deutschen Texte übernommen werden sollen","Replace by an invalid language key if German descriptions are not wanted","Sprache 1:","DEU","durch ungültigen Sprachschlüssel ersetzen, wenn keine deutschen Texte übernommen werden sollen","Replace by an invalid language key if German descriptions are not wanted","Sprache 1:","DEU","durch ungültigen Sprachschlüssel ersetzen, wenn keine deutschen Texte übernommen werden sollen","Replace by an invalid language key if German descriptions are not wanted","Sprache 1:","DEU","durch ungültigen Sprachschlüssel ersetzen, wenn keine deutschen Texte übernommen werden sollen","Replace by an invalid language key if German descriptions are not wanted","Sprache 1:","DEU","durch ungültigen Sprachschlüssel ersetzen, wenn keine deutschen Texte übernommen werden sollen","Replace by an invalid language key if German descriptions are not wanted","Sprache 1:","DEU","durch ungültigen Sprachschlüssel ersetzen, wenn keine deutschen Texte übernommen werden sollen","Replace by an invalid language key if German descriptions are not wanted","Sprache 1:","DEU","durch ungültigen Sprachschlüssel ersetzen, wenn keine deutschen Texte übernommen werden sollen","Replace by an invalid language key if German descriptions are not wanted","Sprache 1:","DEU","durch ungültigen Sprachschlüssel ersetzen, wenn keine deutschen Texte übernommen werden sollen","Replace by an invalid language key if German descriptions are not wanted","Sprache 1:","DEU","durch ungültigen Sprachschlüssel ersetzen, wenn keine deutschen Texte übernommen werden sollen","Replace by an invalid language key if German descriptions are not wanted","Sprache 1:","DEU","durch ungültigen Sprachschlüssel ersetzen, wenn keine deutschen Texte übernommen werden sollen","Replace by an invalid language key if German descriptions are not wanted","Sprache 1:","DEU","durch ungültigen Sprachschlüssel ersetzen, wenn keine deutschen Texte übernommen werden sollen","Replace by an invalid language key if German descriptions are not wanted","Sprache 1:","DEU","durch ungültigen Sprachschlüssel ersetzen, wenn keine deutschen Texte übernommen werden sollen","Replace by an invalid language key if German descriptions are not wanted","Sprache 1:","DEU","durch ungültigen Sprachschlüssel ersetzen, wenn keine deutschen Texte übernommen werden sollen","Replace by an invalid language key if German descriptions are not wanted","Sprache 1:","DEU","durch ungültigen Sprachschlüssel ersetzen, wenn keine deutschen Texte übernommen werden sollen","Replace by an invalid language key if German descriptions are not wanted","Sprache 1:","DEU","durch ungültigen Sprachschlüssel ersetzen, wenn keine deutschen Texte übernommen werden sollen","Replace by an invalid language key if German descriptions are not wanted","Sprache 1:","DEU","durch ungültigen Sprachschlüssel ersetzen, wenn keine deutschen Texte übernommen werden sollen","Replace by an invalid language key if German descriptions are not wanted","Sprache 1:","DEU","durch ungültigen Sprachschlüssel ersetzen, wenn keine deutschen Texte übernommen werden sollen","Replace by an invalid language key if German descriptions are not wanted","Sprache 1:","DEU","durch ungültigen Sprachschlüssel ersetzen, wenn keine deutschen Texte übernommen werden sollen","Replace by an invalid language key if German descriptions are not wanted","Sprache 1:","DEU","durch ungültigen Sprachschlüssel ersetzen, wenn keine deutschen Texte übernommen werden sollen","Replace by an invalid language key if German descriptions are not wanted","Sprache 1:","DEU","durch ungültigen Sprachschlüssel ersetzen, wenn keine deutschen Texte übernommen werden sollen","Replace by an invalid language key if German descriptions are not wanted","Sprache 1:","DEU","durch ungültigen Sprachschlüssel ersetzen, wenn keine deutschen Texte übernommen werden sollen","Replace by an invalid language key if German descriptions are not wanted","Sprache 1:","DEU","durch ungültigen Sprachschlüssel ersetzen, wenn keine deutschen Texte übernommen werden sollen","Replace by an invalid language key if German descriptions are not wanted","Sprache 1:","DEU","durch ungültigen Sprachschlüssel ersetzen, wenn keine deutschen Texte übernommen werden sollen","Replace by an invalid language key if German descriptions are not wanted","Sprache 1:","DEU","durch ungültigen Sprachschlüssel ersetzen, wenn keine deutschen Texte übernommen werden sollen","Replace by an invalid language key if German descriptions are not wanted","Sprache 1:","DEU","durch ungültigen Sprachschlüssel ersetzen, wenn keine deutschen Texte übernommen werden sollen","Replace by an invalid language key if German descriptions are not wanted","Sprache 1:","DEU","durch ungültigen Sprachschlüssel ersetzen, wenn keine deutschen Texte übernommen werden sollen","Replace by an invalid language key if German descriptions are not wanted","Sprache 1:","DEU","durch ungültigen Sprachschlüssel ersetzen, wenn keine deutschen Texte übernommen werden sollen","Replace by an invalid language key if German descriptions are not wanted","Sprache 1:","DEU","durch ungültigen Sprachschlüssel ersetzen, wenn keine deutschen Texte übernommen werden sollen","Replace by an invalid language key if German descriptions are not wanted","Sprache 1:","DEU","durch ungültigen Sprachschlüssel ersetzen, wenn keine deutschen Texte übernommen werden sollen","Replace by an invalid language key if German descriptions are not wanted","Sprache 1:","DEU","durch ungültigen Sprachschlüssel ersetzen, wenn keine deutschen Texte übernommen werden sollen","Replace by an invalid language key if German descriptions are not wanted","Sprache 1:","DEU","durch ungültigen Sprachschlüssel ersetzen, wenn keine deutschen Texte übernommen werden sollen","Replace by an invalid language key if German descriptions are not wanted","Sprache 1:","DEU","durch ungültigen Sprachschlüssel ersetzen, wenn keine deutschen Texte übernommen werden sollen","Replace by an invalid language key if German descriptions are not wanted","Sprache 1:","DEU","durch ungültigen Sprachschlüssel ersetzen, wenn keine deutschen Texte übernommen werden sollen","Replace by an invalid language key if German descriptions are not wanted","Sprache 1:","DEU","durch ungültigen Sprachschlüssel ersetzen, wenn keine deutschen Texte übernommen werden sollen","Replace by an invalid language key if German descriptions are not wanted","Sprache 1:","DEU","durch ungültigen Sprachschlüssel ersetzen, wenn keine deutschen Texte übernommen werden sollen","Replace by an invalid language key if German descriptions are not wanted","Sprache 1:","DEU","durch ungültigen Sprachschlüssel ersetzen, wenn keine deutschen Texte übernommen werden sollen","Replace by an invalid language key if German descriptions are not wanted","Sprache 1:","DEU","durch ungültigen Sprachschlüssel ersetzen, wenn keine deutschen Texte übernommen werden sollen","Replace by an invalid language key if German descriptions are not wanted","Sprache 1:","DEU","durch ungültigen Sprachschlüssel ersetzen, wenn keine deutschen Texte übernommen werden sollen","Replace by an invalid language key if German descriptions are not wanted","Sprache 1:","DEU","durch ungültigen Sprachschlüssel ersetzen, wenn keine deutschen Texte übernommen werden sollen","Replace by an invalid language key if German descriptions are not wanted","Sprache 1:","DEU","durch ungültigen Sprachschlüssel ersetzen, wenn keine deutschen Texte übernommen werden sollen","Replace by an invalid language key if German descriptions are not wanted","Sprache 1:","DEU","durch ungültigen Sprachschlüssel ersetzen, wenn keine deutschen Texte übernommen werden sollen","Replace by an invalid language key if German descriptions are not wanted","Sprache 1:","DEU","durch ungültigen Sprachschlüssel ersetzen, wenn keine deutschen Texte übernommen werden sollen","Replace by an invalid language key if German descriptions are not wanted","Sprache 1:","DEU","durch ungültigen Sprachschlüssel ersetzen, wenn keine deutschen Texte übernommen werden sollen","Replace by an invalid language key if German descriptions are not wanted","Sprache 1:","DEU","durch ungültigen Sprachschlüssel ersetzen, wenn keine deutschen Texte übernommen werden sollen","Replace by an invalid language key if German descriptions are not wanted","Sprache 1:","DEU","durch ungültigen Sprachschlüssel ersetzen, wenn keine deutschen Texte übernommen werden sollen","Replace by an invalid language key if German descriptions are not wanted","Sprache 1:","DEU","durch ungültigen Sprachschlüssel ersetzen, wenn keine deutschen Texte übernommen werden sollen","Replace by an invalid language key if German descriptions are not wanted","Sprache 1:","DEU","durch ungültigen Sprachschlüssel ersetzen, wenn keine deutschen Texte übernommen werden sollen","Replace by an invalid language key if German descriptions are not wanted","Sprache 1:","DEU","durch ungültigen Sprachschlüssel ersetzen, wenn keine deutschen Texte übernommen werden sollen","Replace by an invalid language key if German descriptions are not wanted","Sprache 1:","DEU","durch ungültigen Sprachschlüssel ersetzen, wenn keine deutschen Texte übernommen werden sollen","Replace by an invalid language key if German descriptions are not wanted","Sprache 1:","DEU","durch ungültigen Sprachschlüssel ersetzen, wenn keine deutschen Texte übernommen werden sollen","Replace by an invalid language key if German descriptions are not wanted","Sprache 1:","DEU","durch ungültigen Sprachschlüssel ersetzen, wenn keine deutschen Texte übernommen werden sollen","Replace by an invalid language key if German descriptions are not wanted","Sprache 1:","DEU","durch ungültigen Sprachschlüssel ersetzen, wenn keine deutschen Texte übernommen werden sollen","Replace by an invalid language key if German descriptions are not wanted","Sprache 1:","DEU","durch ungültigen Sprachschlüssel ersetzen, wenn keine deutschen Texte übernommen werden sollen","Replace by an invalid language key if German descriptions are not wanted","Sprache 1:","DEU","durch ungültigen Sprachschlüssel ersetzen, wenn keine deutschen Texte übernommen werden sollen","Replace by an invalid language key if German descriptions are not wanted","Sprache 1:","DEU","durch ungültigen Sprachschlüssel ersetzen, wenn keine deutschen Texte übernommen werden sollen","Replace by an invalid language key if German descriptions are not wanted","Sprache 1:","DEU","durch ungültigen Sprachschlüssel ersetzen, wenn keine deutschen Texte übernommen werden sollen","Replace by an invalid language key if German descriptions are not wanted","Sprache 1:","DEU","durch ungültigen Sprachschlüssel ersetzen, wenn keine deutschen Texte übernommen werden sollen","Replace by an invalid language key if German descriptions are not wanted","Sprache 1:","DEU","durch ungültigen Sprachschlüssel ersetzen, wenn keine deutschen Texte übernommen werden sollen","Replace by an invalid language key if German descriptions are not wanted","Sprache 1:","DEU","durch ungültigen Sprachschlüssel ersetzen, wenn keine deutschen Texte übernommen werden sollen","Replace by an invalid language key if German descriptions are not wanted","Sprache 1:","DEU","durch ungültigen Sprachschlüssel ersetzen, wenn keine deutschen Texte übernommen werden sollen","Replace by an invalid language key if German descriptions are not wanted","Sprache 1:","DEU","durch ungültigen Sprachschlüssel ersetzen, wenn keine deutschen Texte übernommen werden sollen","Replace by an invalid language key if German descriptions are not wanted","Sprache 1:","DEU","durch ungültigen Sprachschlüssel ersetzen, wenn keine deutschen Texte übernommen werden sollen","Replace by an invalid language key if German descriptions are not wanted","Sprache 1:","DEU","durch ungültigen Sprachschlüssel ersetzen, wenn keine deutschen Texte übernommen werden sollen","Replace by an invalid language key if German descriptions are not wanted","Sprache 1:","DEU","durch ungültigen Sprachschlüssel ersetzen, wenn keine deutschen Texte übernommen werden sollen","Replace by an invalid language key if German descriptions are not wanted","Sprache 1:","DEU","durch ungültigen Sprachschlüssel ersetzen, wenn keine deutschen Texte übernommen werden sollen","Replace by an invalid language key if German descriptions are not wanted","Sprache 1:","DEU","durch ungültigen Sprachschlüssel ersetzen, wenn keine deutschen Texte übernommen werden sollen","Replace by an invalid language key if German descriptions are not wanted","Sprache 1:","DEU","durch ungültigen Sprachschlüssel ersetzen, wenn keine deutschen Texte übernommen werden sollen","Replace by an invalid language key if German descriptions are not wanted","Sprache 1:","DEU","durch ungültigen Sprachschlüssel ersetzen, wenn keine deutschen Texte übernommen werden sollen","Replace by an invalid language key if German descriptions are not wanted","Sprache 1:","DEU","durch ungültigen Sprachschlüssel ersetzen, wenn keine deutschen Texte übernommen werden sollen","Replace by an invalid language key if German descriptions are not wanted","Sprache 1:","DEU","durch ungültigen Sprachschlüssel ersetzen, wenn keine deutschen Texte übernommen werden sollen","Replace by an invalid language key if German descriptions are not wanted","Sprache 1:","DEU","durch ungültigen Sprachschlüssel ersetzen, wenn keine deutschen Texte übernommen werden sollen","Replace by an invalid language key if German descriptions are not wanted","Sprache 1:","DEU","durch ungültigen Sprachschlüssel ersetzen, wenn keine deutschen Texte übernommen werden sollen","Replace by an invalid language key if German descriptions are not wanted","Sprache 1:","DEU","durch ungültigen Sprachschlüssel ersetzen, wenn keine deutschen Texte übernommen werden sollen","Replace by an invalid language key if German descriptions are not wanted","Sprache 1:","DEU","durch ungültigen Sprachschlüssel ersetzen, wenn keine deutschen Texte übernommen werden sollen","Replace by an invalid language key if German descriptions are not wanted","Sprache 1:","DEU","durch ungültigen Sprachschlüssel ersetzen, wenn keine deutschen Texte übernommen werden sollen","Replace by an invalid language key if German descriptions are not wanted","Sprache 1:","DEU","durch ungültigen Sprachschlüssel ersetzen, wenn keine deutschen Texte übernommen werden sollen","Replace by an invalid language key if German descriptions are not wanted","Sprache 1:","DEU","durch ungültigen Sprachschlüssel ersetzen, wenn keine deutschen Texte übernommen werden sollen","Replace by an invalid language key if German descriptions are not wanted","Sprache 1:","DEU","durch ungültigen Sprachschlüssel ersetzen, wenn keine deutschen Texte übernommen werden sollen","Replace by an invalid language key if German descriptions are not wanted","Sprache 1:","DEU","durch ungültigen Sprachschlüssel ersetzen, wenn keine deutschen Texte übernommen werden sollen","Replace by an invalid language key if German descriptions are not wanted","Sprache 1:","DEU","durch ungültigen Sprachschlüssel ersetzen, wenn keine deutschen Texte übernommen werden sollen","Replace by an invalid language key if German descriptions are not wanted","Sprache 1:","DEU","durch ungültigen Sprachschlüssel ersetzen, wenn keine deutschen Texte übernommen werden sollen","Replace by an invalid language key if German descriptions are not wanted","Sprache 1:","DEU","durch ungültigen Sprachschlüssel ersetzen, wenn keine deutschen Texte übernommen werden sollen","Replace by an invalid language key if German descriptions are not wanted","Sprache 1:","DEU","durch ungültigen Sprachschlüssel ersetzen, wenn keine deutschen Texte übernommen werden sollen","Replace by an invalid language key if German descriptions are not wanted","Sprache 1:","DEU","durch ungültigen Sprachschlüssel ersetzen, wenn keine deutschen Texte übernommen werden sollen","Replace by an invalid language key if German descriptions are not wanted","Sprache 1:","DEU","durch ungültigen Sprachschlüssel ersetzen, wenn keine deutschen Texte übernommen werden sollen","Replace by an invalid language key if German descriptions are not wanted","Sprache 1:","DEU","durch ungültigen Sprachschlüssel ersetzen, wenn keine deutschen Texte übernommen werden sollen","Replace by an invalid language key if German descriptions are not wanted","Sprache 1:","DEU","durch ungültigen Sprachschlüssel ersetzen, wenn keine deutschen Texte übernommen werden sollen","Replace by an invalid language key if German descriptions are not wanted","Sprache 1:","DEU","durch ungültigen Sprachschlüssel ersetzen, wenn keine deutschen Texte übernommen werden sollen","Replace by an invalid language key if German descriptions are not wanted","Sprache 1:","DEU","durch ungültigen Sprachschlüssel ersetzen, wenn keine deutschen Texte übernommen werden sollen","Replace by an invalid language key if German descriptions are not wanted","Sprache 1:","DEU","durch ungültigen Sprachschlüssel ersetzen, wenn keine deutschen Texte übernommen werden sollen","Replace by an invalid language key if German descriptions are not wanted","Sprache 1:","DEU","durch ungültigen Sprachschlüssel ersetzen, wenn keine deutschen Texte übernommen werden sollen","Replace by an invalid language key if German descriptions are not wanted","Sprache 1:","DEU","durch ungültigen Sprachschlüssel ersetzen, wenn keine deutschen Texte übernommen werden sollen","Replace by an invalid language key if German descriptions are not wanted","Sprache 1:","DEU","durch ungültigen Sprachschlüssel ersetzen, wenn keine deutschen Texte übernommen werden sollen","Replace by an invalid language key if German descriptions are not wanted","Sprache 1:","DEU","durch ungültigen Sprachschlüssel ersetzen, wenn keine deutschen Texte übernommen werden sollen","Replace by an invalid language key if German descriptions are not wanted","Sprache 1:","DEU","durch ungültigen Sprachschlüssel ersetzen, wenn keine deutschen Texte übernommen werden sollen","Replace by an invalid language key if German descriptions are not wanted","Sprache 1:","DEU","durch ungültigen Sprachschlüssel ersetzen, wenn keine deutschen Texte übernommen werden sollen","Replace by an invalid language key if German descriptions are not wanted","Sprache 1:","DEU","durch ungültigen Sprachschlüssel ersetzen, wenn keine deutschen Texte übernommen werden sollen","Replace by an invalid language key if German descriptions are not wanted","Sprache 1:","DEU","durch ungültigen Sprachschlüssel ersetzen, wenn keine deutschen Texte übernommen werden sollen","Replace by an invalid language key if German descriptions are not wanted","Sprache 1:","DEU","durch ungültigen Sprachschlüssel ersetzen, wenn keine deutschen Texte übernommen werden sollen","Replace by an invalid language key if German descriptions are not wanted","Sprache 1:","DEU","durch ungültigen Sprachschlüssel ersetzen, wenn keine deutschen Texte übernommen werden sollen","Replace by an invalid language key if German descriptions are not wanted","Sprache 1:","DEU","durch ungültigen Sprachschlüssel ersetzen, wenn keine deutschen Texte übernommen werden sollen","Replace by an invalid language key if German descriptions are not wanted","Sprache 1:","DEU","durch ungültigen Sprachschlüssel ersetzen, wenn keine deutschen Texte übernommen werden sollen","Replace by an invalid language key if German descriptions are not wanted","Sprache 1:","DEU","durch ungültigen Sprachschlüssel ersetzen, wenn keine deutschen Texte übernommen werden sollen","Replace by an invalid language key if German descriptions are not wanted","Sprache 1:","DEU","durch ungültigen Sprachschlüssel ersetzen, wenn keine deutschen Texte übernommen werden sollen","Replace by an invalid language key if German descriptions are not wanted","Sprache 1:","DEU","durch ungültigen Sprachschlüssel ersetzen, wenn keine deutschen Texte übernommen werden sollen","Replace by an invalid language key if German descriptions are not wanted","Sprache 1:","DEU","durch ungültigen Sprachschlüssel ersetzen, wenn keine deutschen Texte übernommen werden sollen","Replace by an invalid language key if German descriptions are not wanted","Sprache 1:","DEU","durch ungültigen Sprachschlüssel ersetzen, wenn keine deutschen Texte übernommen werden sollen","Replace by an invalid language key if German descriptions are not wanted","Sprache 1:","DEU","durch ungültigen Sprachschlüssel ersetzen, wenn keine deutschen Texte übernommen werden sollen","Replace by an invalid language key if German descriptions are not wanted","Sprache 1:","DEU","durch ungültigen Sprachschlüssel ersetzen, wenn keine deutschen Texte übernommen werden sollen","Replace by an invalid language key if German descriptions are not wanted","Sprache 1:","DEU","durch ungültigen Sprachschlüssel ersetzen, wenn keine deutschen Texte übernommen werden sollen","Replace by an invalid language key if German descriptions are not wanted","Sprache 1:","DEU","durch ungültigen Sprachschlüssel ersetzen, wenn keine deutschen Texte übernommen werden sollen","Replace by an invalid language key if German descriptions are not wanted","Sprache 1:","DEU","durch ungültigen Sprachschlüssel ersetzen, wenn keine deutschen Texte übernommen werden sollen","Replace by an invalid language key if German descriptions are not wanted","Sprache 1:","DEU","durch ungültigen Sprachschlüssel ersetzen, wenn keine deutschen Texte übernommen werden sollen","Replace by an invalid language key if German descriptions are not wanted","Sprache 1:","DEU","durch ungültigen Sprachschlüssel ersetzen, wenn keine deutschen Texte übernommen werden sollen","Replace by an invalid language key if German descriptions are not wanted","Sprache 1:","DEU","durch ungültigen Sprachschlüssel ersetzen, wenn keine deutschen Texte übernommen werden sollen","Replace by an invalid language key if German descriptions are not wanted","Sprache 1:","DEU","durch ungültigen Sprachschlüssel ersetzen, wenn keine deutschen Texte übernommen werden sollen","Replace by an invalid language key if German descriptions are not wanted","Sprache 1:","DEU","durch ungültigen Sprachschlüssel ersetzen, wenn keine deutschen Texte übernommen werden sollen","Replace by an invalid language key if German descriptions are not wanted","Sprache 1:","DEU","durch ungültigen Sprachschlüssel ersetzen, wenn keine deutschen Texte übernommen werden sollen","Replace by an invalid language key if German descriptions are not wanted","Sprache 1:","DEU","durch ungültigen Sprachschlüssel ersetzen, wenn keine deutschen Texte übernommen werden sollen","Replace by an invalid language key if German descriptions are not wanted","Sprache 1:","DEU","durch ungültigen Sprachschlüssel ersetzen, wenn keine deutschen Texte übernommen werden sollen","Replace by an invalid language key if German descriptions are not wanted","Sprache 1:","DEU","durch ungültigen Sprachschlüssel ersetzen, wenn keine deutschen Texte übernommen werden sollen","Replace by an invalid language key if German descriptions are not wanted","Sprache 1:","DEU","durch ungültigen Sprachschlüssel ersetzen, wenn keine deutschen Texte übernommen werden sollen","Replace by an invalid language key if German descriptions are not wanted","Sprache 1:","DEU","durch ungültigen Sprachschlüssel ersetzen, wenn keine deutschen Texte übernommen werden sollen","Replace by an invalid language key if German descriptions are not wanted","Sprache 1:","DEU","durch ungültigen Sprachschlüssel ersetzen, wenn keine deutschen Texte übernommen werden sollen","Replace by an invalid language key if German descriptions are not wanted","Sprache 1:","DEU","durch ungültigen Sprachschlüssel ersetzen, wenn keine deutschen Texte übernommen werden sollen","Replace by an invalid language key if German descriptions are not wanted","Sprache 1:","DEU","durch ungültigen Sprachschlüssel ersetzen, wenn keine deutschen Texte übernommen werden sollen","Replace by an invalid language key if German descriptions are not wanted","Sprache 1:","DEU","durch ungültigen Sprachschlüssel ersetzen, wenn keine deutschen Texte übernommen werden sollen","Replace by an invalid language key if German descriptions are not wanted","Sprache 1:","DEU","durch ungültigen Sprachschlüssel ersetzen, wenn keine deutschen Texte übernommen werden sollen","Replace by an invalid language key if German descriptions are not wanted","Sprache 1:","DEU","durch ungültigen Sprachschlüssel ersetzen, wenn keine deutschen Texte übernommen werden sollen","Replace by an invalid language key if German descriptions are not wanted","Sprache 1:","DEU","durch ungültigen Sprachschlüssel ersetzen, wenn keine deutschen Texte übernommen werden sollen","Replace by an invalid language key if German descriptions are not wanted","Sprache 1:","DEU","durch ungültigen Sprachschlüssel ersetzen, wenn keine deutschen Texte übernommen werden sollen","Replace by an invalid language key if German descriptions are not wanted","Sprache 1:","DEU","durch ungültigen Sprachschlüssel ersetzen, wenn keine deutschen Texte übernommen werden sollen","Replace by an invalid language key if German descriptions are not wanted","Sprache 1:","DEU","durch ungültigen Sprachschlüssel ersetzen, wenn keine deutschen Texte übernommen werden sollen","Replace by an invalid language key if German descriptions are not wanted","Sprache 1:","DEU","durch ungültigen Sprachschlüssel ersetzen, wenn keine deutschen Texte übernommen werden sollen","Replace by an invalid language key if German descriptions are not wanted","Sprache 1:","DEU","durch ungültigen Sprachschlüssel ersetzen, wenn keine deutschen Texte übernommen werden sollen","Replace by an invalid language key if German descriptions are not wanted","Sprache 1:","DEU","durch ungültigen Sprachschlüssel ersetzen, wenn keine deutschen Texte übernommen werden sollen","Replace by an invalid language key if German descriptions are not wanted","Sprache 1:","DEU","durch ungültigen Sprachschlüssel ersetzen, wenn keine deutschen Texte übernommen werden sollen","Replace by an invalid language key if German descriptions are not wanted","Sprache 1:","DEU","durch ungültigen Sprachschlüssel ersetzen, wenn keine deutschen Texte übernommen werden sollen","Replace by an invalid language key if German descriptions are not wanted","Sprache 1:","DEU","durch ungültigen Sprachschlüssel ersetzen, wenn keine deutschen Texte übernommen werden sollen","Replace by an invalid language key if German descriptions are not wanted","Sprache 1:","DEU","durch ungültigen Sprachschlüssel ersetzen, wenn keine deutschen Texte übernommen werden sollen","Replace by an invalid language key if German descriptions are not wanted","Sprache 1:","DEU","durch ungültigen Sprachschlüssel ersetzen, wenn keine deutschen Texte übernommen werden sollen","Replace by an invalid language key if German descriptions are not wanted","Sprache 1:","DEU","durch ungültigen Sprachschlüssel ersetzen, wenn keine deutschen Texte übernommen werden sollen","Replace by an invalid language key if German descriptions are not wanted","Sprache 1:","DEU","durch ungültigen Sprachschlüssel ersetzen, wenn keine deutschen Texte übernommen werden sollen","Replace by an invalid language key if German descriptions are not wanted","Sprache 1:","DEU","durch ungültigen Sprachschlüssel ersetzen, wenn keine deutschen Texte übernommen werden sollen","Replace by an invalid language key if German descriptions are not wanted","Sprache 1:","DEU","durch ungültigen Sprachschlüssel ersetzen, wenn keine deutschen Texte übernommen werden sollen","Replace by an invalid language key if German descriptions are not wanted","Sprache 1:","DEU","durch ungültigen Sprachschlüssel ersetzen, wenn keine deutschen Texte übernommen werden sollen","Replace by an invalid language key if German descriptions are not wanted","Sprache 1:","DEU","durch ungültigen Sprachschlüssel ersetzen, wenn keine deutschen Texte übernommen werden sollen","Replace by an invalid language key if German descriptions are not wanted","Sprache 1:","DEU","durch ungültigen Sprachschlüssel ersetzen, wenn keine deutschen Texte übernommen werden sollen","Replace by an invalid language key if German descriptions are not wanted","Sprache 1:","DEU","durch ungültigen Sprachschlüssel ersetzen, wenn keine deutschen Texte übernommen werden sollen","Replace by an invalid language key if German descriptions are not wanted","Sprache 1:","DEU","durch ungültigen Sprachschlüssel ersetzen, wenn keine deutschen Texte übernommen werden sollen","Replace by an invalid language key if German descriptions are not wanted","Sprache 1:","DEU","durch ungültigen Sprachschlüssel ersetzen, wenn keine deutschen Texte übernommen werden sollen","Replace by an invalid language key if German descriptions are not wanted","Sprache 1:","DEU","durch ungültigen Sprachschlüssel ersetzen, wenn keine deutschen Texte übernommen werden sollen","Replace by an invalid language key if German descriptions are not wanted","Sprache 1:","DEU","durch ungültigen Sprachschlüssel ersetzen, wenn keine deutschen Texte übernommen werden sollen","Replace by an invalid language key if German descriptions are not wanted","Sprache 1:","DEU","durch ungültigen Sprachschlüssel ersetzen, wenn keine deutschen Texte übernommen werden sollen","Replace by an invalid language key if German descriptions are not wanted","Sprache 1:","DEU","durch ungültigen Sprachschlüssel ersetzen, wenn keine deutschen Texte übernommen werden sollen","Replace by an invalid language key if German descriptions are not wanted","Sprache 1:","DEU","durch ungültigen Sprachschlüssel ersetzen, wenn keine deutschen Texte übernommen werden sollen","Replace by an invalid language key if German descriptions are not wanted","Sprache 1:","DEU","durch ungültigen Sprachschlüssel ersetzen, wenn keine deutschen Texte übernommen werden sollen","Replace by an invalid language key if German descriptions are not wanted","Sprache 1:","DEU","durch ungültigen Sprachschlüssel ersetzen, wenn keine deutschen Texte übernommen werden sollen","Replace by an invalid language key if German descriptions are not wanted","Sprache 1:","DEU","durch ungültigen Sprachschlüssel ersetzen, wenn keine deutschen Texte übernommen werden sollen","Replace by an invalid language key if German descriptions are not wanted","Sprache 1:","DEU","durch ungültigen Sprachschlüssel ersetzen, wenn keine deutschen Texte übernommen werden sollen","Replace by an invalid language key if German descriptions are not wanted","Sprache 1:","DEU","durch ungültigen Sprachschlüssel ersetzen, wenn keine deutschen Texte übernommen werden sollen","Replace by an invalid language key if German descriptions are not wanted","Sprache 1:","DEU","durch ungültigen Sprachschlüssel ersetzen, wenn keine deutschen Texte übernommen werden sollen","Replace by an invalid language key if German descriptions are not wanted","Sprache 1:","DEU","durch ungültigen Sprachschlüssel ersetzen, wenn keine deutschen Texte übernommen werden sollen","Replace by an invalid language key if German descriptions are not wanted","Sprache 1:","DEU","durch ungültigen Sprachschlüssel ersetzen, wenn keine deutschen Texte übernommen werden sollen","Replace by an invalid language key if German descriptions are not wanted","Sprache 1:","DEU","durch ungültigen Sprachschlüssel ersetzen, wenn keine deutschen Texte übernommen werden sollen","Replace by an invalid language key if German descriptions are not wanted","Sprache 1:","DEU","durch ungültigen Sprachschlüssel ersetzen, wenn keine deutschen Texte übernommen werden sollen","Replace by an invalid language key if German descriptions are not wanted","Sprache 1:","DEU","durch ungültigen Sprachschlüssel ersetzen, wenn keine deutschen Texte übernommen werden sollen","Replace by an invalid language key if German descriptions are not wanted","Sprache 1:","DEU","durch ungültigen Sprachschlüssel ersetzen, wenn keine deutschen Texte übernommen werden sollen","Replace by an invalid language key if German descriptions are not wanted","Sprache 1:","DEU","durch ungültigen Sprachschlüssel ersetzen, wenn keine deutschen Texte übernommen werden sollen","Replace by an invalid language key if German descriptions are not wanted","Sprache 1:","DEU","durch ungültigen Sprachschlüssel ersetzen, wenn keine deutschen Texte übernommen werden sollen","Replace by an invalid language key if German descriptions are not wanted","Sprache 1:","DEU","durch ungültigen Sprachschlüssel ersetzen, wenn keine deutschen Texte übernommen werden sollen","Replace by an invalid language key if German descriptions are not wanted","Sprache 1:","DEU","durch ungültigen Sprachschlüssel ersetzen, wenn keine deutschen Texte übernommen werden sollen","Replace by an invalid language key if German descriptions are not wanted","Sprache 1:","DEU","durch ungültigen Sprachschlüssel ersetzen, wenn keine deutschen Texte übernommen werden sollen","Replace by an invalid language key if German descriptions are not wanted","Sprache 1:","DEU","durch ungültigen Sprachschlüssel ersetzen, wenn keine deutschen Texte übernommen werden sollen","Replace by an invalid language key if German descriptions are not wanted","Sprache 1:","DEU","durch ungültigen Sprachschlüssel ersetzen, wenn keine deutschen Texte übernommen werden sollen","Replace by an invalid language key if German descriptions are not wanted","Sprache 1:","DEU","durch ungültigen Sprachschlüssel ersetzen, wenn keine deutschen Texte übernommen werden sollen","Replace by an invalid language key if German descriptions are not wanted","Sprache 1:","DEU","durch ungültigen Sprachschlüssel ersetzen, wenn keine deutschen Texte übernommen werden sollen","Replace by an invalid language key if German descriptions are not wanted","Sprache 1:","DEU","durch ungültigen Sprachschlüssel ersetzen, wenn keine deutschen Texte übernommen werden sollen","Replace by an invalid language key if German descriptions are not wanted","Sprache 1:","DEU","durch ungültigen Sprachschlüssel ersetzen, wenn keine deutschen Texte übernommen werden sollen","Replace by an invalid language key if German descriptions are not wanted","Sprache 1:","DEU","durch ungültigen Sprachschlüssel ersetzen, wenn keine deutschen Texte übernommen werden sollen","Replace by an invalid language key if German descriptions are not wanted","Sprache 1:","DEU","durch ungültigen Sprachschlüssel ersetzen, wenn keine deutschen Texte übernommen werden sollen","Replace by an invalid language key if German descriptions are not wanted","Sprache 1:","DEU","durch ungültigen Sprachschlüssel ersetzen, wenn keine deutschen Texte übernommen werden sollen","Replace by an invalid language key if German descriptions are not wanted","Sprache 1:","DEU","durch ungültigen Sprachschlüssel ersetzen, wenn keine deutschen Texte übernommen werden sollen","Replace by an invalid language key if German descriptions are not wanted","Sprache 1:","DEU","durch ungültigen Sprachschlüssel ersetzen, wenn keine deutschen Texte übernommen werden sollen","Replace by an invalid language key if German descriptions are not wanted","Sprache 1:","DEU","durch ungültigen Sprachschlüssel ersetzen, wenn keine deutschen Texte übernommen werden sollen","Replace by an invalid language key if German descriptions are not wanted","Sprache 1:","DEU","durch ungültigen Sprachschlüssel ersetzen, wenn keine deutschen Texte übernommen werden sollen","Replace by an invalid language key if German descriptions are not wanted","Sprache 1:","DEU","durch ungültigen Sprachschlüssel ersetzen, wenn keine deutschen Texte übernommen werden sollen","Replace by an invalid language key if German descriptions are not wanted","Sprache 1:","DEU","durch ungültigen Sprachschlüssel ersetzen, wenn keine deutschen Texte übernommen werden sollen","Replace by an invalid language key if German descriptions are not wanted","Sprache 1:","DEU","durch ungültigen Sprachschlüssel ersetzen, wenn keine deutschen Texte übernommen werden sollen","Replace by an invalid language key if German descriptions are not wanted","Sprache 1:","DEU","durch ungültigen Sprachschlüssel ersetzen, wenn keine deutschen Texte übernommen werden sollen","Replace by an invalid language key if German descriptions are not wanted","Sprache 1:","DEU","durch ungültigen Sprachschlüssel ersetzen, wenn keine deutschen Texte übernommen werden sollen","Replace by an invalid language key if German descriptions are not wanted","Sprache 1:","DEU","durch ungültigen Sprachschlüssel ersetzen, wenn keine deutschen Texte übernommen werden sollen","Replace by an invalid language key if German descriptions are not wanted","Sprache 1:","DEU","durch ungültigen Sprachschlüssel ersetzen, wenn keine deutschen Texte übernommen werden sollen","Replace by an invalid language key if German descriptions are not wanted","Sprache 1:","DEU","durch ungültigen Sprachschlüssel ersetzen, wenn keine deutschen Texte übernommen werden sollen","Replace by an invalid language key if German descriptions are not wanted","Sprache 1:","DEU","durch ungültigen Sprachschlüssel ersetzen, wenn keine deutschen Texte übernommen werden sollen","Replace by an invalid language key if German descriptions are not wanted","Sprache 1:","DEU","durch ungültigen Sprachschlüssel ersetzen, wenn keine deutschen Texte übernommen werden sollen","Replace by an invalid language key if German descriptions are not wanted","Sprache 1:","DEU","durch ungültigen Sprachschlüssel ersetzen, wenn keine deutschen Texte übernommen werden sollen","Replace by an invalid language key if German descriptions are not wanted","Sprache 1:","DEU","durch ungültigen Sprachschlüssel ersetzen, wenn keine deutschen Texte übernommen werden sollen","Replace by an invalid language key if German descriptions are not wanted","Sprache 1:","DEU","durch ungültigen Sprachschlüssel ersetzen, wenn keine deutschen Texte übernommen werden sollen","Replace by an invalid language key if German descriptions are not wanted","Sprache 1:","DEU","durch ungültigen Sprachschlüssel ersetzen, wenn keine deutschen Texte übernommen werden sollen","Replace by an invalid language key if German descriptions are not wanted","Sprache 1:","DEU","durch ungültigen Sprachschlüssel ersetzen, wenn keine deutschen Texte übernommen werden sollen","Replace by an invalid language key if German descriptions are not wanted","Sprache 1:","DEU","durch ungültigen Sprachschlüssel ersetzen, wenn keine deutschen Texte übernommen werden sollen","Replace by an invalid language key if German descriptions are not wanted","Sprache 1:","DEU","durch ungültigen Sprachschlüssel ersetzen, wenn keine deutschen Texte übernommen werden sollen","Replace by an invalid language key if German descriptions are not wanted","Sprache 1:","DEU","durch ungültigen Sprachschlüssel ersetzen, wenn keine deutschen Texte übernommen werden sollen","Replace by an invalid language key if German descriptions are not wanted","Sprache 1:","DEU","durch ungültigen Sprachschlüssel ersetzen, wenn keine deutschen Texte übernommen werden sollen","Replace by an invalid language key if German descriptions are not wanted","Sprache 1:","DEU","durch ungültigen Sprachschlüssel ersetzen, wenn keine deutschen Texte übernommen werden sollen","Replace by an invalid language key if German descriptions are not wanted","Sprache 1:","DEU","durch ungültigen Sprachschlüssel ersetzen, wenn keine deutschen Texte übernommen werden sollen","Replace by an invalid language key if German descriptions are not wanted","Sprache 1:","DEU","durch ungültigen Sprachschlüssel ersetzen, wenn keine deutschen Texte übernommen werden sollen","Replace by an invalid language key if German descriptions are not wanted","Sprache 1:","DEU","durch ungültigen Sprachschlüssel ersetzen, wenn keine deutschen Texte übernommen werden sollen","Replace by an invalid language key if German descriptions are not wanted","Sprache 1:","DEU","durch ungültigen Sprachschlüssel ersetzen, wenn keine deutschen Texte übernommen werden sollen","Replace by an invalid language key if German descriptions are not wanted","Sprache 1:","DEU","durch ungültigen Sprachschlüssel ersetzen, wenn keine deutschen Texte übernommen werden sollen","Replace by an invalid language key if German descriptions are not wanted","Sprache 1:","DEU","durch ungültigen Sprachschlüssel ersetzen, wenn keine deutschen Texte übernommen werden sollen","Replace by an invalid language key if German descriptions are not wanted","Sprache 1:","DEU","durch ungültigen Sprachschlüssel ersetzen, wenn keine deutschen Texte übernommen werden sollen","Replace by an invalid language key if German descriptions are not wanted","Sprache 1:","DEU","durch ungültigen Sprachschlüssel ersetzen, wenn keine deutschen Texte übernommen werden sollen","Replace by an invalid language key if German descriptions are not wanted","Sprache 1:","DEU","durch ungültigen Sprachschlüssel ersetzen, wenn keine deutschen Texte übernommen werden sollen","Replace by an invalid language key if German descriptions are not wanted","Sprache 1:","DEU","durch ungültigen Sprachschlüssel ersetzen, wenn keine deutschen Texte übernommen werden sollen","Replace by an invalid language key if German descriptions are not wanted","Sprache 1:","DEU","durch ungültigen Sprachschlüssel ersetzen, wenn keine deutschen Texte übernommen werden sollen","Replace by an invalid language key if German descriptions are not wanted","Sprache 1:","DEU","durch ungültigen Sprachschlüssel ersetzen, wenn keine deutschen Texte übernommen werden sollen","Replace by an invalid language key if German descriptions are not wanted","Sprache 1:","DEU","durch ungültigen Sprachschlüssel ersetzen, wenn keine deutschen Texte übernommen werden sollen","Replace by an invalid language key if German descriptions are not wanted","Sprache 1:","DEU","durch ungültigen Sprachschlüssel ersetzen, wenn keine deutschen Texte übernommen werden sollen","Replace by an invalid language key if German descriptions are not wanted","Sprache 1:","DEU","durch ungültigen Sprachschlüssel ersetzen, wenn keine deutschen Texte übernommen werden sollen","Replace by an invalid language key if German descriptions are not wanted","Sprache 1:","DEU","durch ungültigen Sprachschlüssel ersetzen, wenn keine deutschen Texte übernommen werden sollen","Replace by an invalid language key if German descriptions are not wanted","Sprache 1:","DEU","durch ungültigen Sprachschlüssel ersetzen, wenn keine deutschen Texte übernommen werden sollen","Replace by an invalid language key if German descriptions are not wanted","Sprache 1:","DEU","durch ungültigen Sprachschlüssel ersetzen, wenn keine deutschen Texte übernommen werden sollen","Replace by an invalid language key if German descriptions are not wanted","Sprache 1:","DEU","durch ungültigen Sprachschlüssel ersetzen, wenn keine deutschen Texte übernommen werden sollen","Replace by an invalid language key if German descriptions are not wanted","Sprache 1:","DEU","durch ungültigen Sprachschlüssel ersetzen, wenn keine deutschen Texte übernommen werden sollen","Replace by an invalid language key if German descriptions are not wanted","Sprache 1:","DEU","durch ungültigen Sprachschlüssel ersetzen, wenn keine deutschen Texte übernommen werden sollen","Replace by an invalid language key if German descriptions are not wanted","Sprache 1:","DEU","durch ungültigen Sprachschlüssel ersetzen, wenn keine deutschen Texte übernommen werden sollen","Replace by an invalid language key if German descriptions are not wanted","Sprache 1:","DEU","durch ungültigen Sprachschlüssel ersetzen, wenn keine deutschen Texte übernommen werden sollen","Replace by an invalid language key if German descriptions are not wanted","Sprache 1:","DEU","durch ungültigen Sprachschlüssel ersetzen, wenn keine deutschen Texte übernommen werden sollen","Replace by an invalid language key if German descriptions are not wanted","Sprache 1:","DEU","durch ungültigen Sprachschlüssel ersetzen, wenn keine deutschen Texte übernommen werden sollen","Replace by an invalid language key if German descriptions are not wanted","Sprache 1:","DEU","durch ungültigen Sprachschlüssel ersetzen, wenn keine deutschen Texte übernommen werden sollen","Replace by an invalid language key if German descriptions are not wanted","Sprache 1:","DEU","durch ungültigen Sprachschlüssel ersetzen, wenn keine deutschen Texte übernommen werden sollen","Replace by an invalid language key if German descriptions are not wanted","Sprache 1:","DEU","durch ungültigen Sprachschlüssel ersetzen, wenn keine deutschen Texte übernommen werden sollen","Replace by an invalid language key if German descriptions are not wanted","Sprache 1:","DEU","durch ungültigen Sprachschlüssel ersetzen, wenn keine deutschen Texte übernommen werden sollen","Replace by an invalid language key if German descriptions are not wanted","Sprache 1:","DEU","durch ungültigen Sprachschlüssel ersetzen, wenn keine deutschen Texte übernommen werden sollen","Replace by an invalid language key if German descriptions are not wanted","Sprache 1:","DEU","durch ungültigen Sprachschlüssel ersetzen, wenn keine deutschen Texte übernommen werden sollen","Replace by an invalid language key if German descriptions are not wanted","Sprache 1:","DEU","durch ungültigen Sprachschlüssel ersetzen, wenn keine deutschen Texte übernommen werden sollen","Replace by an invalid language key if German descriptions are not wanted","Sprache 1:","DEU","durch ungültigen Sprachschlüssel ersetzen, wenn keine deutschen Texte übernommen werden sollen","Replace by an invalid language key if German descriptions are not wanted","Sprache 1:","DEU","durch ungültigen Sprachschlüssel ersetzen, wenn keine deutschen Texte übernommen werden sollen","Replace by an invalid language key if German descriptions are not wanted","Sprache 1:","DEU","durch ungültigen Sprachschlüssel ersetzen, wenn keine deutschen Texte übernommen werden sollen","Replace by an invalid language key if German descriptions are not wanted","Sprache 1:","DEU","durch ungültigen Sprachschlüssel ersetzen, wenn keine deutschen Texte übernommen werden sollen","Replace by an invalid language key if German descriptions are not wanted","Sprache 1:","DEU","durch ungültigen Sprachschlüssel ersetzen, wenn keine deutschen Texte übernommen werden sollen","Replace by an invalid language key if German descriptions are not wanted","Sprache 1:","DEU","durch ungültigen Sprachschlüssel ersetzen, wenn keine deutschen Texte übernommen werden sollen","Replace by an invalid language key if German descriptions are not wanted","Sprache 1:","DEU","durch ungültigen Sprachschlüssel ersetzen, wenn keine deutschen Texte übernommen werden sollen","Replace by an invalid language key if German descriptions are not wanted","Sprache 1:","DEU","durch ungültigen Sprachschlüssel ersetzen, wenn keine deutschen Texte übernommen werden sollen","Replace by an invalid language key if German descriptions are not wanted","Sprache 1:","DEU","durch ungültigen Sprachschlüssel ersetzen, wenn keine deutschen Texte übernommen werden sollen","Replace by an invalid language key if German descriptions are not wanted","Sprache 1:","DEU","durch ungültigen Sprachschlüssel ersetzen, wenn keine deutschen Texte übernommen werden sollen","Replace by an invalid language key if German descriptions are not wanted","Sprache 1:","DEU","durch ungültigen Sprachschlüssel ersetzen, wenn keine deutschen Texte übernommen werden sollen","Replace by an invalid language key if German descriptions are not wanted","Sprache 1:","DEU","durch ungültigen Sprachschlüssel ersetzen, wenn keine deutschen Texte übernommen werden sollen","Replace by an invalid language key if German descriptions are not wanted","Sprache 1:","DEU","durch ungültigen Sprachschlüssel ersetzen, wenn keine deutschen Texte übernommen werden sollen","Replace by an invalid language key if German descriptions are not wanted","Sprache 1:","DEU","durch ungültigen Sprachschlüssel ersetzen, wenn keine deutschen Texte übernommen werden sollen","Replace by an invalid language key if German descriptions are not wanted","Sprache 1:","DEU","durch ungültigen Sprachschlüssel ersetzen, wenn keine deutschen Texte übernommen werden sollen","Replace by an invalid language key if German descriptions are not wanted","Sprache 1:","DEU","durch ungültigen Sprachschlüssel ersetzen, wenn keine deutschen Texte übernommen werden sollen","Replace by an invalid language key if German descriptions are not wanted","Sprache 1:","DEU","durch ungültigen Sprachschlüssel ersetzen, wenn keine deutschen Texte übernommen werden sollen","Replace by an invalid language key if German descriptions are not wanted","Sprache 1:","DEU","durch ungültigen Sprachschlüssel ersetzen, wenn keine deutschen Texte übernommen werden sollen","Replace by an invalid language key if German descriptions are not wanted","Sprache 1:","DEU","durch ungültigen Sprachschlüssel ersetzen, wenn keine deutschen Texte übernommen werden sollen","Replace by an invalid language key if German descriptions are not wanted","Sprache 1:","DEU","durch ungültigen Sprachschlüssel ersetzen, wenn keine deutschen Texte übernommen werden sollen","Replace by an invalid language key if German descriptions are not wanted","Sprache 1:","DEU","durch ungültigen Sprachschlüssel ersetzen, wenn keine deutschen Texte übernommen werden sollen","Replace by an invalid language key if German descriptions are not wanted","Sprache 1:","DEU","durch ungültigen Sprachschlüssel ersetzen, wenn keine deutschen Texte übernommen werden sollen","Replace by an invalid language key if German descriptions are not wanted","Sprache 1:","DEU","durch ungültigen Sprachschlüssel ersetzen, wenn keine deutschen Texte übernommen werden sollen","Replace by an invalid language key if German descriptions are not wanted","Sprache 1:","DEU","durch ungültigen Sprachschlüssel ersetzen, wenn keine deutschen Texte übernommen werden sollen","Replace by an invalid language key if German descriptions are not wanted","Sprache 1:","DEU","durch ungültigen Sprachschlüssel ersetzen, wenn keine deutschen Texte übernommen werden sollen","Replace by an invalid language key if German descriptions are not wanted","Sprache 1:","DEU","durch ungültigen Sprachschlüssel ersetzen, wenn keine deutschen Texte übernommen werden sollen","Replace by an invalid language key if German descriptions are not wanted","Sprache 1:","DEU","durch ungültigen Sprachschlüssel ersetzen, wenn keine deutschen Texte übernommen werden sollen","Replace by an invalid language key if German descriptions are not wanted","Sprache 1:","DEU","durch ungültigen Sprachschlüssel ersetzen, wenn keine deutschen Texte übernommen werden sollen","Replace by an invalid language key if German descriptions are not wanted","Sprache 1:","DEU","durch ungültigen Sprachschlüssel ersetzen, wenn keine deutschen Texte übernommen werden sollen","Replace by an invalid language key if German descriptions are not wanted","Sprache 1:","DEU","durch ungültigen Sprachschlüssel ersetzen, wenn keine deutschen Texte übernommen werden sollen","Replace by an invalid language key if German descriptions are not wanted","Sprache 1:","DEU","durch ungültigen Sprachschlüssel ersetzen, wenn keine deutschen Texte übernommen werden sollen","Replace by an invalid language key if German descriptions are not wanted","Sprache 1:","DEU","durch ungültigen Sprachschlüssel ersetzen, wenn keine deutschen Texte übernommen werden sollen","Replace by an invalid language key if German descriptions are not wanted","Sprache 1:","DEU","durch ungültigen Sprachschlüssel ersetzen, wenn keine deutschen Texte übernommen werden sollen","Replace by an invalid language key if German descriptions are not wanted","Sprache 1:","DEU","durch ungültigen Sprachschlüssel ersetzen, wenn keine deutschen Texte übernommen werden sollen","Replace by an invalid language key if German descriptions are not wanted","Sprache 1:","DEU","durch ungültigen Sprachschlüssel ersetzen, wenn keine deutschen Texte übernommen werden sollen","Replace by an invalid language key if German descriptions are not wanted","Sprache 1:","DEU","durch ungültigen Sprachschlüssel ersetzen, wenn keine deutschen Texte übernommen werden sollen","Replace by an invalid language key if German descriptions are not wanted","Sprache 1:","DEU","durch ungültigen Sprachschlüssel ersetzen, wenn keine deutschen Texte übernommen werden sollen","Replace by an invalid language key if German descriptions are not wanted","Sprache 1:","DEU","durch ungültigen Sprachschlüssel ersetzen, wenn keine deutschen Texte übernommen werden sollen","Replace by an invalid language key if German descriptions are not wanted","Sprache 1:","DEU","durch ungültigen Sprachschlüssel ersetzen, wenn keine deutschen Texte übernommen werden sollen","Replace by an invalid language key if German descriptions are not wanted","Sprache 1:","DEU","durch ungültigen Sprachschlüssel ersetzen, wenn keine deutschen Texte übernommen werden sollen","Replace by an invalid language key if German descriptions are not wanted","Sprache 1:","DEU","durch ungültigen Sprachschlüssel ersetzen, wenn keine deutschen Texte übernommen werden sollen","Replace by an invalid language key if German descriptions are not wanted","Sprache 1:","DEU","durch ungültigen Sprachschlüssel ersetzen, wenn keine deutschen Texte übernommen werden sollen","Replace by an invalid language key if German descriptions are not wanted","Sprache 1:","DEU","durch ungültigen Sprachschlüssel ersetzen, wenn keine deutschen Texte übernommen werden sollen","Replace by an invalid language key if German descriptions are not wanted","Sprache 1:","DEU","durch ungültigen Sprachschlüssel ersetzen, wenn keine deutschen Texte übernommen werden sollen","Replace by an invalid language key if German descriptions are not wanted","Sprache 1:","DEU","durch ungültigen Sprachschlüssel ersetzen, wenn keine deutschen Texte übernommen werden sollen","Replace by an invalid language key if German descriptions are not wanted","Sprache 1:","DEU","durch ungültigen Sprachschlüssel ersetzen, wenn keine deutschen Texte übernommen werden sollen","Replace by an invalid language key if German descriptions are not wanted","Sprache 1:","DEU","durch ungültigen Sprachschlüssel ersetzen, wenn keine deutschen Texte übernommen werden sollen","Replace by an invalid language key if German descriptions are not wanted","Sprache 1:","DEU","durch ungültigen Sprachschlüssel ersetzen, wenn keine deutschen Texte übernommen werden sollen","Replace by an invalid language key if German descriptions are not wanted","Sprache 1:","DEU","durch ungültigen Sprachschlüssel ersetzen, wenn keine deutschen Texte übernommen werden sollen","Replace by an invalid language key if German descriptions are not wanted","Sprache 1:","DEU","durch ungültigen Sprachschlüssel ersetzen, wenn keine deutschen Texte übernommen werden sollen","Replace by an invalid language key if German descriptions are not wanted","Sprache 1:","DEU","durch ungültigen Sprachschlüssel ersetzen, wenn keine deutschen Texte übernommen werden sollen","Replace by an invalid language key if German descriptions are not wanted","Sprache 1:","DEU","durch ungültigen Sprachschlüssel ersetzen, wenn keine deutschen Texte übernommen werden sollen","Replace by an invalid language key if German descriptions are not wanted","Sprache 1:","DEU","durch ungültigen Sprachschlüssel ersetzen, wenn keine deutschen Texte übernommen werden sollen","Replace by an invalid language key if German descriptions are not wanted","Sprache 1:","DEU","durch ungültigen Sprachschlüssel ersetzen, wenn keine deutschen Texte übernommen werden sollen","Replace by an invalid language key if German descriptions are not wanted","Sprache 1:","DEU","durch ungültigen Sprachschlüssel ersetzen, wenn keine deutschen Texte übernommen werden sollen","Replace by an invalid language key if German descriptions are not wanted","Sprache 1:","DEU","durch ungültigen Sprachschlüssel ersetzen, wenn keine deutschen Texte übernommen werden sollen","Replace by an invalid language key if German descriptions are not wanted","Sprache 1:","DEU","durch ungültigen Sprachschlüssel ersetzen, wenn keine deutschen Texte übernommen werden sollen","Replace by an invalid language key if German descriptions are not wanted","Sprache 1:","DEU","durch ungültigen Sprachschlüssel ersetzen, wenn keine deutschen Texte übernommen werden sollen","Replace by an invalid language key if German descriptions are not wanted","Sprache 1:","DEU","durch ungültigen Sprachschlüssel ersetzen, wenn keine deutschen Texte übernommen werden sollen","Replace by an invalid language key if German descriptions are not wanted","Sprache 1:","DEU","durch ungültigen Sprachschlüssel ersetzen, wenn keine deutschen Texte übernommen werden sollen","Replace by an invalid language key if German descriptions are not wanted","Sprache 1:","DEU","durch ungültigen Sprachschlüssel ersetzen, wenn keine deutschen Texte übernommen werden sollen","Replace by an invalid language key if German descriptions are not wanted","Sprache 1:","DEU","durch ungültigen Sprachschlüssel ersetzen, wenn keine deutschen Texte übernommen werden sollen","Replace by an invalid language key if German descriptions are not wanted","Sprache 1:","DEU","durch ungültigen Sprachschlüssel ersetzen, wenn keine deutschen Texte übernommen werden sollen","Replace by an invalid language key if German descriptions are not wanted","Sprache 1:","DEU","durch ungültigen Sprachschlüssel ersetzen, wenn keine deutschen Texte übernommen werden sollen","Replace by an invalid language key if German descriptions are not wanted","Sprache 1:","DEU","durch ungültigen Sprachschlüssel ersetzen, wenn keine deutschen Texte übernommen werden sollen","Replace by an invalid language key if German descriptions are not wanted","Sprache 1:","DEU","durch ungültigen Sprachschlüssel ersetzen, wenn keine deutschen Texte übernommen werden sollen","Replace by an invalid language key if German descriptions are not wanted","Sprache 1:","DEU","durch ungültigen Sprachschlüssel ersetzen, wenn keine deutschen Texte übernommen werden sollen","Replace by an invalid language key if German descriptions are not wanted","Sprache 1:","DEU","durch ungültigen Sprachschlüssel ersetzen, wenn keine deutschen Texte übernommen werden sollen","Replace by an invalid language key if German descriptions are not wanted","Sprache 1:","DEU","durch ungültigen Sprachschlüssel ersetzen, wenn keine deutschen Texte übernommen werden sollen","Replace by an invalid language key if German descriptions are not wanted","Sprache 1:","DEU","durch ungültigen Sprachschlüssel ersetzen, wenn keine deutschen Texte übernommen werden sollen","Replace by an invalid language key if German descriptions are not wanted","Sprache 1:","DEU","durch ungültigen Sprachschlüssel ersetzen, wenn keine deutschen Texte übernommen werden sollen","Replace by an invalid language key if German descriptions are not wanted","Sprache 1:","DEU","durch ungültigen Sprachschlüssel ersetzen, wenn keine deutschen Texte übernommen werden sollen","Replace by an invalid language key if German descriptions are not wanted","Sprache 1:","DEU","durch ungültigen Sprachschlüssel ersetzen, wenn keine deutschen Texte übernommen werden sollen","Replace by an invalid language key if German descriptions are not wanted","Sprache 1:","DEU","durch ungültigen Sprachschlüssel ersetzen, wenn keine deutschen Texte übernommen werden sollen","Replace by an invalid language key if German descriptions are not wanted","Sprache 1:","DEU","durch ungültigen Sprachschlüssel ersetzen, wenn keine deutschen Texte übernommen werden sollen","Replace by an invalid language key if German descriptions are not wanted","Sprache 1:","DEU","durch ungültigen Sprachschlüssel ersetzen, wenn keine deutschen Texte übernommen werden sollen","Replace by an invalid language key if German descriptions are not wanted","Sprache 1:","DEU","durch ungültigen Sprachschlüssel ersetzen, wenn keine deutschen Texte übernommen werden sollen","Replace by an invalid language key if German descriptions are not wanted","Sprache 1:","DEU","durch ungültigen Sprachschlüssel ersetzen, wenn keine deutschen Texte übernommen werden sollen","Replace by an invalid language key if German descriptions are not wanted","Sprache 1:","DEU","durch ungültigen Sprachschlüssel ersetzen, wenn keine deutschen Texte übernommen werden sollen","Replace by an invalid language key if German descriptions are not wanted","Sprache 1:","DEU","durch ungültigen Sprachschlüssel ersetzen, wenn keine deutschen Texte übernommen werden sollen","Replace by an invalid language key if German descriptions are not wanted","Sprache 1:","DEU","durch ungültigen Sprachschlüssel ersetzen, wenn keine deutschen Texte übernommen werden sollen","Replace by an invalid language key if German descriptions are not wanted","Sprache 1:","DEU","durch ungültigen Sprachschlüssel ersetzen, wenn keine deutschen Texte übernommen werden sollen","Replace by an invalid language key if German descriptions are not wanted","Sprache 1:","DEU","durch ungültigen Sprachschlüssel ersetzen, wenn keine deutschen Texte übernommen werden sollen","Replace by an invalid language key if German descriptions are not wanted","Sprache 1:","DEU","durch ungültigen Sprachschlüssel ersetzen, wenn keine deutschen Texte übernommen werden sollen","Replace by an invalid language key if German descriptions are not wanted","Sprache 1:","DEU","durch ungültigen Sprachschlüssel ersetzen, wenn keine deutschen Texte übernommen werden sollen","Replace by an invalid language key if German descriptions are not wanted","Sprache 1:","DEU","durch ungültigen Sprachschlüssel ersetzen, wenn keine deutschen Texte übernommen werden sollen","Replace by an invalid language key if German descriptions are not wanted","Sprache 1:","DEU","durch ungültigen Sprachschlüssel ersetzen, wenn keine deutschen Texte übernommen werden sollen","Replace by an invalid language key if German descriptions are not wanted","Sprache 1:","DEU","durch ungültigen Sprachschlüssel ersetzen, wenn keine deutschen Texte übernommen werden sollen","Replace by an invalid language key if German descriptions are not wanted","Sprache 1:","DEU","durch ungültigen Sprachschlüssel ersetzen, wenn keine deutschen Texte übernommen werden sollen","Replace by an invalid language key if German descriptions are not wanted","Sprache 1:","DEU","durch ungültigen Sprachschlüssel ersetzen, wenn keine deutschen Texte übernommen werden sollen","Replace by an invalid language key if German descriptions are not wanted","Sprache 1:","DEU","durch ungültigen Sprachschlüssel ersetzen, wenn keine deutschen Texte übernommen werden sollen","Replace by an invalid language key if German descriptions are not wanted","Sprache 1:","DEU","durch ungültigen Sprachschlüssel ersetzen, wenn keine deutschen Texte übernommen werden sollen","Replace by an invalid language key if German descriptions are not wanted","Sprache 1:","DEU","durch ungültigen Sprachschlüssel ersetzen, wenn keine deutschen Texte übernommen werden sollen","Replace by an invalid language key if German descriptions are not wanted","Sprache 1:","DEU","durch ungültigen Sprachschlüssel ersetzen, wenn keine deutschen Texte übernommen werden sollen","Replace by an invalid language key if German descriptions are not wanted","Sprache 1:","DEU","durch ungültigen Sprachschlüssel ersetzen, wenn keine deutschen Texte übernommen werden sollen","Replace by an invalid language key if German descriptions are not wanted","Sprache 1:","DEU","durch ungültigen Sprachschlüssel ersetzen, wenn keine deutschen Texte übernommen werden sollen","Replace by an invalid language key if German descriptions are not wanted","Sprache 1:","DEU","durch ungültigen Sprachschlüssel ersetzen, wenn keine deutschen Texte übernommen werden sollen","Replace by an invalid language key if German descriptions are not wanted","Sprache 1:","DEU","durch ungültigen Sprachschlüssel ersetzen, wenn keine deutschen Texte übernommen werden sollen","Replace by an invalid language key if German descriptions are not wanted","Sprache 1:","DEU","durch ungültigen Sprachschlüssel ersetzen, wenn keine deutschen Texte übernommen werden sollen","Replace by an invalid language key if German descriptions are not wanted","Sprache 1:","DEU","durch ungültigen Sprachschlüssel ersetzen, wenn keine deutschen Texte übernommen werden sollen","Replace by an invalid language key if German descriptions are not wanted","Sprache 1:","DEU","durch ungültigen Sprachschlüssel ersetzen, wenn keine deutschen Texte übernommen werden sollen","Replace by an invalid language key if German descriptions are not wanted","Sprache 1:","DEU","durch ungültigen Sprachschlüssel ersetzen, wenn keine deutschen Texte übernommen werden sollen","Replace by an invalid language key if German descriptions are not wanted","Sprache 1:","DEU","durch ungültigen Sprachschlüssel ersetzen, wenn keine deutschen Texte übernommen werden sollen","Replace by an invalid language key if German descriptions are not wanted","Sprache 1:","DEU","durch ungültigen Sprachschlüssel ersetzen, wenn keine deutschen Texte übernommen werden sollen","Replace by an invalid language key if German descriptions are not wanted","Sprache 1:","DEU","durch ungültigen Sprachschlüssel ersetzen, wenn keine deutschen Texte übernommen werden sollen","Replace by an invalid language key if German descriptions are not wanted","Sprache 1:","DEU","durch ungültigen Sprachschlüssel ersetzen, wenn keine deutschen Texte übernommen werden sollen","Replace by an invalid language key if German descriptions are not wanted","Sprache 1:","DEU","durch ungültigen Sprachschlüssel ersetzen, wenn keine deutschen Texte übernommen werden sollen","Replace by an invalid language key if German descriptions are not wanted","Sprache 1:","DEU","durch ungültigen Sprachschlüssel ersetzen, wenn keine deutschen Texte übernommen werden sollen","Replace by an invalid language key if German descriptions are not wanted","Sprache 1:","DEU","durch ungültigen Sprachschlüssel ersetzen, wenn keine deutschen Texte übernommen werden sollen","Replace by an invalid language key if German descriptions are not wanted","Sprache 1:","DEU","durch ungültigen Sprachschlüssel ersetzen, wenn keine deutschen Texte übernommen werden sollen","Replace by an invalid language key if German descriptions are not wanted","Sprache 1:","DEU","durch ungültigen Sprachschlüssel ersetzen, wenn keine deutschen Texte übernommen werden sollen","Replace by an invalid language key if German descriptions are not wanted","Sprache 1:","DEU","durch ungültigen Sprachschlüssel ersetzen, wenn keine deutschen Texte übernommen werden sollen","Replace by an invalid language key if German descriptions are not wanted","Sprache 1:","DEU","durch ungültigen Sprachschlüssel ersetzen, wenn keine deutschen Texte übernommen werden sollen","Replace by an invalid language key if German descriptions are not wanted","Sprache 1:","DEU","durch ungültigen Sprachschlüssel ersetzen, wenn keine deutschen Texte übernommen werden sollen","Replace by an invalid language key if German descriptions are not wanted","Sprache 1:","DEU","durch ungültigen Sprachschlüssel ersetzen, wenn keine deutschen Texte übernommen werden sollen","Replace by an invalid language key if German descriptions are not wanted","Sprache 1:","DEU","durch ungültigen Sprachschlüssel ersetzen, wenn keine deutschen Texte übernommen werden sollen","Replace by an invalid language key if German descriptions are not wanted","Sprache 1:","DEU","durch ungültigen Sprachschlüssel ersetzen, wenn keine deutschen Texte übernommen werden sollen","Replace by an invalid language key if German descriptions are not wanted","Sprache 1:","DEU","durch ungültigen Sprachschlüssel ersetzen, wenn keine deutschen Texte übernommen werden sollen","Replace by an invalid language key if German descriptions are not wanted","Sprache 1:","DEU","durch ungültigen Sprachschlüssel ersetzen, wenn keine deutschen Texte übernommen werden sollen","Replace by an invalid language key if German descriptions are not wanted","Sprache 1:","DEU","durch ungültigen Sprachschlüssel ersetzen, wenn keine deutschen Texte übernommen werden sollen","Replace by an invalid language key if German descriptions are not wanted","Sprache 1:","DEU","durch ungültigen Sprachschlüssel ersetzen, wenn keine deutschen Texte übernommen werden sollen","Replace by an invalid language key if German descriptions are not wanted","Sprache 1:","DEU","durch ungültigen Sprachschlüssel ersetzen, wenn keine deutschen Texte übernommen werden sollen","Replace by an invalid language key if German descriptions are not wanted","Sprache 1:","DEU","durch ungültigen Sprachschlüssel ersetzen, wenn keine deutschen Texte übernommen werden sollen","Replace by an invalid language key if German descriptions are not wanted","Sprache 1:","DEU","durch ungültigen Sprachschlüssel ersetzen, wenn keine deutschen Texte übernommen werden sollen","Replace by an invalid language key if German descriptions are not wanted","Sprache 1:","DEU","durch ungültigen Sprachschlüssel ersetzen, wenn keine deutschen Texte übernommen werden sollen","Replace by an invalid language key if German descriptions are not wanted","Sprache 1:","DEU","durch ungültigen Sprachschlüssel ersetzen, wenn keine deutschen Texte übernommen werden sollen","Replace by an invalid language key if German descriptions are not wanted","Sprache 1:","DEU","durch ungültigen Sprachschlüssel ersetzen, wenn keine deutschen Texte übernommen werden sollen","Replace by an invalid language key if German descriptions are not wanted","Sprache 1:","DEU","durch ungültigen Sprachschlüssel ersetzen, wenn keine deutschen Texte übernommen werden sollen","Replace by an invalid language key if German descriptions are not wanted","Sprache 1:","DEU","durch ungültigen Sprachschlüssel ersetzen, wenn keine deutschen Texte übernommen werden sollen","Replace by an invalid language key if German descriptions are not wanted","Sprache 1:","DEU","durch ungültigen Sprachschlüssel ersetzen, wenn keine deutschen Texte übernommen werden sollen","Replace by an invalid language key if German descriptions are not wanted","Sprache 1:","DEU","durch ungültigen Sprachschlüssel ersetzen, wenn keine deutschen Texte übernommen werden sollen","Replace by an invalid language key if German descriptions are not wanted","Sprache 1:","DEU","durch ungültigen Sprachschlüssel ersetzen, wenn keine deutschen Texte übernommen werden sollen","Replace by an invalid language key if German descriptions are not wanted","Sprache 1:","DEU","durch ungültigen Sprachschlüssel ersetzen, wenn keine deutschen Texte übernommen werden sollen","Replace by an invalid language key if German descriptions are not wanted","Sprache 1:","DEU","durch ungültigen Sprachschlüssel ersetzen, wenn keine deutschen Texte übernommen werden sollen","Replace by an invalid language key if German descriptions are not wanted","Sprache 1:","DEU","durch ungültigen Sprachschlüssel ersetzen, wenn keine deutschen Texte übernommen werden sollen","Replace by an invalid language key if German descriptions are not wanted","Sprache 1:","DEU","durch ungültigen Sprachschlüssel ersetzen, wenn keine deutschen Texte übernommen werden sollen","Replace by an invalid language key if German descriptions are not wanted","Sprache 1:","DEU","durch ungültigen Sprachschlüssel ersetzen, wenn keine deutschen Texte übernommen werden sollen","Replace by an invalid language key if German descriptions are not wanted","Sprache 1:","DEU","durch ungültigen Sprachschlüssel ersetzen, wenn keine deutschen Texte übernommen werden sollen","Replace by an invalid language key if German descriptions are not wanted","Sprache 1:","DEU","durch ungültigen Sprachschlüssel ersetzen, wenn keine deutschen Texte übernommen werden sollen","Replace by an invalid language key if German descriptions are not wanted","Sprache 1:","DEU","durch ungültigen Sprachschlüssel ersetzen, wenn keine deutschen Texte übernommen werden sollen","Replace by an invalid language key if German descriptions are not wanted","Sprache 1:","DEU","durch ungültigen Sprachschlüssel ersetzen, wenn keine deutschen Texte übernommen werden sollen","Replace by an invalid language key if German descriptions are not wanted","Sprache 1:","DEU","durch ungültigen Sprachschlüssel ersetzen, wenn keine deutschen Texte übernommen werden sollen","Replace by an invalid language key if German descriptions are not wanted","Sprache 1:","DEU","durch ungültigen Sprachschlüssel ersetzen, wenn keine deutschen Texte übernommen werden sollen","Replace by an invalid language key if German descriptions are not wanted","Sprache 1:","DEU","durch ungültigen Sprachschlüssel ersetzen, wenn keine deutschen Texte übernommen werden sollen","Replace by an invalid language key if German descriptions are not wanted","Sprache 1:","DEU","durch ungültigen Sprachschlüssel ersetzen, wenn keine deutschen Texte übernommen werden sollen","Replace by an invalid language key if German descriptions are not wanted","Sprache 1:","DEU","durch ungültigen Sprachschlüssel ersetzen, wenn keine deutschen Texte übernommen werden sollen","Replace by an invalid language key if German descriptions are not wanted","Sprache 1:","DEU","durch ungültigen Sprachschlüssel ersetzen, wenn keine deutschen Texte übernommen werden sollen","Replace by an invalid language key if German descriptions are not wanted","Sprache 1:","DEU","durch ungültigen Sprachschlüssel ersetzen, wenn keine deutschen Texte übernommen werden sollen","Replace by an invalid language key if German descriptions are not wanted","Sprache 1:","DEU","durch ungültigen Sprachschlüssel ersetzen, wenn keine deutschen Texte übernommen werden sollen","Replace by an invalid language key if German descriptions are not wanted","Sprache 1:","DEU","durch ungültigen Sprachschlüssel ersetzen, wenn keine deutschen Texte übernommen werden sollen","Replace by an invalid language key if German descriptions are not wanted","Sprache 1:","DEU","durch ungültigen Sprachschlüssel ersetzen, wenn keine deutschen Texte übernommen werden sollen","Replace by an invalid language key if German descriptions are not wanted","Sprache 1:","DEU","durch ungültigen Sprachschlüssel ersetzen, wenn keine deutschen Texte übernommen werden sollen","Replace by an invalid language key if German descriptions are not wanted","Sprache 1:","DEU","durch ungültigen Sprachschlüssel ersetzen, wenn keine deutschen Texte übernommen werden sollen","Replace by an invalid language key if German descriptions are not wanted","Sprache 1:","DEU","durch ungültigen Sprachschlüssel ersetzen, wenn keine deutschen Texte übernommen werden sollen","Replace by an invalid language key if German descriptions are not wanted","Sprache 1:","DEU","durch ungültigen Sprachschlüssel ersetzen, wenn keine deutschen Texte übernommen werden sollen","Replace by an invalid language key if German descriptions are not wanted","Sprache 1:","DEU","durch ungültigen Sprachschlüssel ersetzen, wenn keine deutschen Texte übernommen werden sollen","Replace by an invalid language key if German descriptions are not wanted","Sprache 1:","DEU","durch ungültigen Sprachschlüssel ersetzen, wenn keine deutschen Texte übernommen werden sollen","Replace by an invalid language key if German descriptions are not wanted","Sprache 1:","DEU","durch ungültigen Sprachschlüssel ersetzen, wenn keine deutschen Texte übernommen werden sollen","Replace by an invalid language key if German descriptions are not wanted","Sprache 1:","DEU","durch ungültigen Sprachschlüssel ersetzen, wenn keine deutschen Texte übernommen werden sollen","Replace by an invalid language key if German descriptions are not wanted","Sprache 1:","DEU","durch ungültigen Sprachschlüssel ersetzen, wenn keine deutschen Texte übernommen werden sollen","Replace by an invalid language key if German descriptions are not wanted","Sprache 1:","DEU","durch ungültigen Sprachschlüssel ersetzen, wenn keine deutschen Texte übernommen werden sollen","Replace by an invalid language key if German descriptions are not wanted","Sprache 1:","DEU","durch ungültigen Sprachschlüssel ersetzen, wenn keine deutschen Texte übernommen werden sollen","Replace by an invalid language key if German descriptions are not wanted","Sprache 1:","DEU","durch ungültigen Sprachschlüssel ersetzen, wenn keine deutschen Texte übernommen werden sollen","Replace by an invalid language key if German descriptions are not wanted","Sprache 1:","DEU","durch ungültigen Sprachschlüssel ersetzen, wenn keine deutschen Texte übernommen werden sollen","Replace by an invalid language key if German descriptions are not wanted","Sprache 1:","DEU","durch ungültigen Sprachschlüssel ersetzen, wenn keine deutschen Texte übernommen werden sollen","Replace by an invalid language key if German descriptions are not wanted","Sprache 1:","DEU","durch ungültigen Sprachschlüssel ersetzen, wenn keine deutschen Texte übernommen werden sollen","Replace by an invalid language key if German descriptions are not wanted","Sprache 1:","DEU","durch ungültigen Sprachschlüssel ersetzen, wenn keine deutschen Texte übernommen werden sollen","Replace by an invalid language key if German descriptions are not wanted","Sprache 1:","DEU","durch ungültigen Sprachschlüssel ersetzen, wenn keine deutschen Texte übernommen werden sollen","Replace by an invalid language key if German descriptions are not wanted","Sprache 1:","DEU","durch ungültigen Sprachschlüssel ersetzen, wenn keine deutschen Texte übernommen werden sollen","Replace by an invalid language key if German descriptions are not wanted","Sprache 1:","DEU","durch ungültigen Sprachschlüssel ersetzen, wenn keine deutschen Texte übernommen werden sollen","Replace by an invalid language key if German descriptions are not wanted","Sprache 1:","DEU","durch ungültigen Sprachschlüssel ersetzen, wenn keine deutschen Texte übernommen werden sollen","Replace by an invalid language key if German descriptions are not wanted","Sprache 1:","DEU","durch ungültigen Sprachschlüssel ersetzen, wenn keine deutschen Texte übernommen werden sollen","Replace by an invalid language key if German descriptions are not wanted","Sprache 1:","DEU","durch ungültigen Sprachschlüssel ersetzen, wenn keine deutschen Texte übernommen werden sollen","Replace by an invalid language key if German descriptions are not wanted","Sprache 1:","DEU","durch ungültigen Sprachschlüssel ersetzen, wenn keine deutschen Texte übernommen werden sollen","Replace by an invalid language key if German descriptions are not wanted","Sprache 1:","DEU","durch ungültigen Sprachschlüssel ersetzen, wenn keine deutschen Texte übernommen werden sollen","Replace by an invalid language key if German descriptions are not wanted","Sprache 1:","DEU","durch ungültigen Sprachschlüssel ersetzen, wenn keine deutschen Texte übernommen werden sollen","Replace by an invalid language key if German descriptions are not wanted","Sprache 1:","DEU","durch ungültigen Sprachschlüssel ersetzen, wenn keine deutschen Texte übernommen werden sollen","Replace by an invalid language key if German descriptions are not wanted","Sprache 1:","DEU","durch ungültigen Sprachschlüssel ersetzen, wenn keine deutschen Texte übernommen werden sollen","Replace by an invalid language key if German descriptions are not wanted","Sprache 1:","DEU","durch ungültigen Sprachschlüssel ersetzen, wenn keine deutschen Texte übernommen werden sollen","Replace by an invalid language key if German descriptions are not wanted","Sprache 1:","DEU","durch ungültigen Sprachschlüssel ersetzen, wenn keine deutschen Texte übernommen werden sollen","Replace by an invalid language key if German descriptions are not wanted","Sprache 1:","DEU","durch ungültigen Sprachschlüssel ersetzen, wenn keine deutschen Texte übernommen werden sollen","Replace by an invalid language key if German descriptions are not wanted","Sprache 1:","DEU","durch ungültigen Sprachschlüssel ersetzen, wenn keine deutschen Texte übernommen werden sollen","Replace by an invalid language key if German descriptions are not wanted","Sprache 1:","DEU","durch ungültigen Sprachschlüssel ersetzen, wenn keine deutschen Texte übernommen werden sollen","Replace by an invalid language key if German descriptions are not wanted","Sprache 1:","DEU","durch ungültigen Sprachschlüssel ersetzen, wenn keine deutschen Texte übernommen werden sollen","Replace by an invalid language key if German descriptions are not wanted","Sprache 1:","DEU","durch ungültigen Sprachschlüssel ersetzen, wenn keine deutschen Texte übernommen werden sollen","Replace by an invalid language key if German descriptions are not wanted","Sprache 1:","DEU","durch ungültigen Sprachschlüssel ersetzen, wenn keine deutschen Texte übernommen werden sollen","Replace by an invalid language key if German descriptions are not wanted","Sprache 1:","DEU","durch ungültigen Sprachschlüssel ersetzen, wenn keine deutschen Texte übernommen werden sollen","Replace by an invalid language key if German descriptions are not wanted","Sprache 1:","DEU","durch ungültigen Sprachschlüssel ersetzen, wenn keine deutschen Texte übernommen werden sollen","Replace by an invalid language key if German descriptions are not wanted","Sprache 1:","DEU","durch ungültigen Sprachschlüssel ersetzen, wenn keine deutschen Texte übernommen werden sollen","Replace by an invalid language key if German descriptions are not wanted","Sprache 1:","DEU","durch ungültigen Sprachschlüssel ersetzen, wenn keine deutschen Texte übernommen werden sollen","Replace by an invalid language key if German descriptions are not wanted","Sprache 1:","DEU","durch ungültigen Sprachschlüssel ersetzen, wenn keine deutschen Texte übernommen werden sollen","Replace by an invalid language key if German descriptions are not wanted","Sprache 1:","DEU","durch ungültigen Sprachschlüssel ersetzen, wenn keine deutschen Texte übernommen werden sollen","Replace by an invalid language key if German descriptions are not wanted","Sprache 1:","DEU","durch ungültigen Sprachschlüssel ersetzen, wenn keine deutschen Texte übernommen werden sollen","Replace by an invalid language key if German descriptions are not wanted","Sprache 1:","DEU","durch ungültigen Sprachschlüssel ersetzen, wenn keine deutschen Texte übernommen werden sollen","Replace by an invalid language key if German descriptions are not wanted","Sprache 1:","DEU","durch ungültigen Sprachschlüssel ersetzen, wenn keine deutschen Texte übernommen werden sollen","Replace by an invalid language key if German descriptions are not wanted","Sprache 1:","DEU","durch ungültigen Sprachschlüssel ersetzen, wenn keine deutschen Texte übernommen werden sollen","Replace by an invalid language key if German descriptions are not wanted","Sprache 1:","DEU","durch ungültigen Sprachschlüssel ersetzen, wenn keine deutschen Texte übernommen werden sollen","Replace by an invalid language key if German descriptions are not wanted","Sprache 1:","DEU","durch ungültigen Sprachschlüssel ersetzen, wenn keine deutschen Texte übernommen werden sollen","Replace by an invalid language key if German descriptions are not wanted","Sprache 1:","DEU","durch ungültigen Sprachschlüssel ersetzen, wenn keine deutschen Texte übernommen werden sollen","Replace by an invalid language key if German descriptions are not wanted","Sprache 1:","DEU","durch ungültigen Sprachschlüssel ersetzen, wenn keine deutschen Texte übernommen werden sollen","Replace by an invalid language key if German descriptions are not wanted","Sprache 1:","DEU","durch ungültigen Sprachschlüssel ersetzen, wenn keine deutschen Texte übernommen werden sollen","Replace by an invalid language key if German descriptions are not wanted","Sprache 1:","DEU","durch ungültigen Sprachschlüssel ersetzen, wenn keine deutschen Texte übernommen werden sollen","Replace by an invalid language key if German descriptions are not wanted","Sprache 1:","DEU","durch ungültigen Sprachschlüssel ersetzen, wenn keine deutschen Texte übernommen werden sollen","Replace by an invalid language key if German descriptions are not wanted","Sprache 1:","DEU","durch ungültigen Sprachschlüssel ersetzen, wenn keine deutschen Texte übernommen werden sollen","Replace by an invalid language key if German descriptions are not wanted","Sprache 1:","DEU","durch ungültigen Sprachschlüssel ersetzen, wenn keine deutschen Texte übernommen werden sollen","Replace by an invalid language key if German descriptions are not wanted","Sprache 1:","DEU","durch ungültigen Sprachschlüssel ersetzen, wenn keine deutschen Texte übernommen werden sollen","Replace by an invalid language key if German descriptions are not wanted","Sprache 1:","DEU","durch ungültigen Sprachschlüssel ersetzen, wenn keine deutschen Texte übernommen werden sollen","Replace by an invalid language key if German descriptions are not wanted","Sprache 1:","DEU","durch ungültigen Sprachschlüssel ersetzen, wenn keine deutschen Texte übernommen werden sollen","Replace by an invalid language key if German descriptions are not wanted","Sprache 1:","DEU","durch ungültigen Sprachschlüssel ersetzen, wenn keine deutschen Texte übernommen werden sollen","Replace by an invalid language key if German descriptions are not wanted","Sprache 1:","DEU","durch ungültigen Sprachschlüssel ersetzen, wenn keine deutschen Texte übernommen werden sollen","Replace by an invalid language key if German descriptions are not wanted","Sprache 1:","DEU","durch ungültigen Sprachschlüssel ersetzen, wenn keine deutschen Texte übernommen werden sollen","Replace by an invalid language key if German descriptions are not wanted","Sprache 1:","DEU","durch ungültigen Sprachschlüssel ersetzen, wenn keine deutschen Texte übernommen werden sollen","Replace by an invalid language key if German descriptions are not wanted","Sprache 1:","DEU","durch ungültigen Sprachschlüssel ersetzen, wenn keine deutschen Texte übernommen werden sollen","Replace by an invalid language key if German descriptions are not wanted","Sprache 1:","DEU","durch ungültigen Sprachschlüssel ersetzen, wenn keine deutschen Texte übernommen werden sollen","Replace by an invalid language key if German descriptions are not wanted","Sprache 1:","DEU","durch ungültigen Sprachschlüssel ersetzen, wenn keine deutschen Texte übernommen werden sollen","Replace by an invalid language key if German descriptions are not wanted","Sprache 1:","DEU","durch ungültigen Sprachschlüssel ersetzen, wenn keine deutschen Texte übernommen werden sollen","Replace by an invalid language key if German descriptions are not wanted","Sprache 1:","DEU","durch ungültigen Sprachschlüssel ersetzen, wenn keine deutschen Texte übernommen werden sollen","Replace by an invalid language key if German descriptions are not wanted","Sprache 1:","DEU","durch ungültigen Sprachschlüssel ersetzen, wenn keine deutschen Texte übernommen werden sollen","Replace by an invalid language key if German descriptions are not wanted","Sprache 1:","DEU","durch ungültigen Sprachschlüssel ersetzen, wenn keine deutschen Texte übernommen werden sollen","Replace by an invalid language key if German descriptions are not wanted","Sprache 1:","DEU","durch ungültigen Sprachschlüssel ersetzen, wenn keine deutschen Texte übernommen werden sollen","Replace by an invalid language key if German descriptions are not wanted","Sprache 1:","DEU","durch ungültigen Sprachschlüssel ersetzen, wenn keine deutschen Texte übernommen werden sollen","Replace by an invalid language key if German descriptions are not wanted","Sprache 1:","DEU","durch ungültigen Sprachschlüssel ersetzen, wenn keine deutschen Texte übernommen werden sollen","Replace by an invalid language key if German descriptions are not wanted","Sprache 1:","DEU","durch ungültigen Sprachschlüssel ersetzen, wenn keine deutschen Texte übernommen werden sollen","Replace by an invalid language key if German descriptions are not wanted","Sprache 1:","DEU","durch ungültigen Sprachschlüssel ersetzen, wenn keine deutschen Texte übernommen werden sollen","Replace by an invalid language key if German descriptions are not wanted","Sprache 1:","DEU","durch ungültigen Sprachschlüssel ersetzen, wenn keine deutschen Texte übernommen werden sollen","Replace by an invalid language key if German descriptions are not wanted","Sprache 1:","DEU","durch ungültigen Sprachschlüssel ersetzen, wenn keine deutschen Texte übernommen werden sollen","Replace by an invalid language key if German descriptions are not wanted","Sprache 1:","DEU","durch ungültigen Sprachschlüssel ersetzen, wenn keine deutschen Texte übernommen werden sollen","Replace by an invalid language key if German descriptions are not wanted","Sprache 1:","DEU","durch ungültigen Sprachschlüssel ersetzen, wenn keine deutschen Texte übernommen werden sollen","Replace by an invalid language key if German descriptions are not wanted","Sprache 1:","DEU","durch ungültigen Sprachschlüssel ersetzen, wenn keine deutschen Texte übernommen werden sollen","Replace by an invalid language key if German descriptions are not wanted","Sprache 1:","DEU","durch ungültigen Sprachschlüssel ersetzen, wenn keine deutschen Texte übernommen werden sollen","Replace by an invalid language key if German descriptions are not wanted","Sprache 1:","DEU","durch ungültigen Sprachschlüssel ersetzen, wenn keine deutschen Texte übernommen werden sollen","Replace by an invalid language key if German descriptions are not wanted","Sprache 1:","DEU","durch ungültigen Sprachschlüssel ersetzen, wenn keine deutschen Texte übernommen werden sollen","Replace by an invalid language key if German descriptions are not wanted","Sprache 1:","DEU","durch ungültigen Sprachschlüssel ersetzen, wenn keine deutschen Texte übernommen werden sollen","Replace by an invalid language key if German descriptions are not wanted","Sprache 1:","DEU","durch ungültigen Sprachschlüssel ersetzen, wenn keine deutschen Texte übernommen werden sollen","Replace by an invalid language key if German descriptions are not wanted","Sprache 1:","DEU","durch ungültigen Sprachschlüssel ersetzen, wenn keine deutschen Texte übernommen werden sollen","Replace by an invalid language key if German descriptions are not wanted","Sprache 1:","DEU","durch ungültigen Sprachschlüssel ersetzen, wenn keine deutschen Texte übernommen werden sollen","Replace by an invalid language key if German descriptions are not wanted","Sprache 1:","DEU","durch ungültigen Sprachschlüssel ersetzen, wenn keine deutschen Texte übernommen werden sollen","Replace by an invalid language key if German descriptions are not wanted","Sprache 1:","DEU","durch ungültigen Sprachschlüssel ersetzen, wenn keine deutschen Texte übernommen werden sollen","Replace by an invalid language key if German descriptions are not wanted","Sprache 1:","DEU","durch ungültigen Sprachschlüssel ersetzen, wenn keine deutschen Texte übernommen werden sollen","Replace by an invalid language key if German descriptions are not wanted","Sprache 1:","DEU","durch ungültigen Sprachschlüssel ersetzen, wenn keine deutschen Texte übernommen werden sollen","Replace by an invalid language key if German descriptions are not wanted","Sprache 1:","DEU","durch ungültigen Sprachschlüssel ersetzen, wenn keine deutschen Texte übernommen werden sollen","Replace by an invalid language key if German descriptions are not wanted","Sprache 1:","DEU","durch ungültigen Sprachschlüssel ersetzen, wenn keine deutschen Texte übernommen werden sollen","Replace by an invalid language key if German descriptions are not wanted","Sprache 1:","DEU","durch ungültigen Sprachschlüssel ersetzen, wenn keine deutschen Texte übernommen werden sollen","Replace by an invalid language key if German descriptions are not wanted","Sprache 1:","DEU","durch ungültigen Sprachschlüssel ersetzen, wenn keine deutschen Texte übernommen werden sollen","Replace by an invalid language key if German descriptions are not wanted","Sprache 1:","DEU","durch ungültigen Sprachschlüssel ersetzen, wenn keine deutschen Texte übernommen werden sollen","Replace by an invalid language key if German descriptions are not wanted","Sprache 1:","DEU","durch ungültigen Sprachschlüssel ersetzen, wenn keine deutschen Texte übernommen werden sollen","Replace by an invalid language key if German descriptions are not wanted","Sprache 1:","DEU","durch ungültigen Sprachschlüssel ersetzen, wenn keine deutschen Texte übernommen werden sollen","Replace by an invalid language key if German descriptions are not wanted","Sprache 1:","DEU","durch ungültigen Sprachschlüssel ersetzen, wenn keine deutschen Texte übernommen werden sollen","Replace by an invalid language key if German descriptions are not wanted","Sprache 1:","DEU","durch ungültigen Sprachschlüssel ersetzen, wenn keine deutschen Texte übernommen werden sollen","Replace by an invalid language key if German descriptions are not wanted","Sprache 1:","DEU","durch ungültigen Sprachschlüssel ersetzen, wenn keine deutschen Texte übernommen werden sollen","Replace by an invalid language key if German descriptions are not wanted","Sprache 1:","DEU","durch ungültigen Sprachschlüssel ersetzen, wenn keine deutschen Texte übernommen werden sollen","Replace by an invalid language key if German descriptions are not wanted","Sprache 1:","DEU","durch ungültigen Sprachschlüssel ersetzen, wenn keine deutschen Texte übernommen werden sollen","Replace by an invalid language key if German descriptions are not wanted","Sprache 1:","DEU","durch ungültigen Sprachschlüssel ersetzen, wenn keine deutschen Texte übernommen werden sollen","Replace by an invalid language key if German descriptions are not wanted","Sprache 1:","DEU","durch ungültigen Sprachschlüssel ersetzen, wenn keine deutschen Texte übernommen werden sollen","Replace by an invalid language key if German descriptions are not wanted","Sprache 1:","DEU","durch ungültigen Sprachschlüssel ersetzen, wenn keine deutschen Texte übernommen werden sollen","Replace by an invalid language key if German descriptions are not wanted","Sprache 1:","DEU","durch ungültigen Sprachschlüssel ersetzen, wenn keine deutschen Texte übernommen werden sollen","Replace by an invalid language key if German descriptions are not wanted","Sprache 1:","DEU","durch ungültigen Sprachschlüssel ersetzen, wenn keine deutschen Texte übernommen werden sollen","Replace by an invalid language key if German descriptions are not wanted","Sprache 1:","DEU","durch ungültigen Sprachschlüssel ersetzen, wenn keine deutschen Texte übernommen werden sollen","Replace by an invalid language key if German descriptions are not wanted","Sprache 1:","DEU","durch ungültigen Sprachschlüssel ersetzen, wenn keine deutschen Texte übernommen werden sollen","Replace by an invalid language key if German descriptions are not wanted","Sprache 1:","DEU","durch ungültigen Sprachschlüssel ersetzen, wenn keine deutschen Texte übernommen werden sollen","Replace by an invalid language key if German descriptions are not wanted","Sprache 1:","DEU","durch ungültigen Sprachschlüssel ersetzen, wenn keine deutschen Texte übernommen werden sollen","Replace by an invalid language key if German descriptions are not wanted","Sprache 1:","DEU","durch ungültigen Sprachschlüssel ersetzen, wenn keine deutschen Texte übernommen werden sollen","Replace by an invalid language key if German descriptions are not wanted","Sprache 1:","DEU","durch ungültigen Sprachschlüssel ersetzen, wenn keine deutschen Texte übernommen werden sollen","Replace by an invalid language key if German descriptions are not wanted","Sprache 1:","DEU","durch ungültigen Sprachschlüssel ersetzen, wenn keine deutschen Texte übernommen werden sollen","Replace by an invalid language key if German descriptions are not wanted","Sprache 1:","DEU","durch ungültigen Sprachschlüssel ersetzen, wenn keine deutschen Texte übernommen werden sollen","Replace by an invalid language key if German descriptions are not wanted","Sprache 1:","DEU","durch ungültigen Sprachschlüssel ersetzen, wenn keine deutschen Texte übernommen werden sollen","Replace by an invalid language key if German descriptions are not wanted","Sprache 1:","DEU","durch ungültigen Sprachschlüssel ersetzen, wenn keine deutschen Texte übernommen werden sollen","Replace by an invalid language key if German descriptions are not wanted","Sprache 1:","DEU","durch ungültigen Sprachschlüssel ersetzen, wenn keine deutschen Texte übernommen werden sollen","Replace by an invalid language key if German descriptions are not wanted","Sprache 1:","DEU","durch ungültigen Sprachschlüssel ersetzen, wenn keine deutschen Texte übernommen werden sollen","Replace by an invalid language key if German descriptions are not wanted","Sprache 1:","DEU","durch ungültigen Sprachschlüssel ersetzen, wenn keine deutschen Texte übernommen werden sollen","Replace by an invalid language key if German descriptions are not wanted","Sprache 1:","DEU","durch ungültigen Sprachschlüssel ersetzen, wenn keine deutschen Texte übernommen werden sollen","Replace by an invalid language key if German descriptions are not wanted","Sprache 1:","DEU","durch ungültigen Sprachschlüssel ersetzen, wenn keine deutschen Texte übernommen werden sollen","Replace by an invalid language key if German descriptions are not wanted","Sprache 1:","DEU","durch ungültigen Sprachschlüssel ersetzen, wenn keine deutschen Texte übernommen werden sollen","Replace by an invalid language key if German descriptions are not wanted","Sprache 1:","DEU","durch ungültigen Sprachschlüssel ersetzen, wenn keine deutschen Texte übernommen werden sollen","Replace by an invalid language key if German descriptions are not wanted","Sprache 1:","DEU","durch ungültigen Sprachschlüssel ersetzen, wenn keine deutschen Texte übernommen werden sollen","Replace by an invalid language key if German descriptions are not wanted","Sprache 1:","DEU","durch ungültigen Sprachschlüssel ersetzen, wenn keine deutschen Texte übernommen werden sollen","Replace by an invalid language key if German descriptions are not wanted","Sprache 1:","DEU","durch ungültigen Sprachschlüssel ersetzen, wenn keine deutschen Texte übernommen werden sollen","Replace by an invalid language key if German descriptions are not wanted","Sprache 1:","DEU","durch ungültigen Sprachschlüssel ersetzen, wenn keine deutschen Texte übernommen werden sollen","Replace by an invalid language key if German descriptions are not wanted","Sprache 1:","DEU","durch ungültigen Sprachschlüssel ersetzen, wenn keine deutschen Texte übernommen werden sollen","Replace by an invalid language key if German descriptions are not wanted","Sprache 1:","DEU","durch ungültigen Sprachschlüssel ersetzen, wenn keine deutschen Texte übernommen werden sollen","Replace by an invalid language key if German descriptions are not wanted","Sprache 1:","DEU","durch ungültigen Sprachschlüssel ersetzen, wenn keine deutschen Texte übernommen werden sollen","Replace by an invalid language key if German descriptions are not wanted","Sprache 1:","DEU","durch ungültigen Sprachschlüssel ersetzen, wenn keine deutschen Texte übernommen werden sollen","Replace by an invalid language key if German descriptions are not wanted","Sprache 1:","DEU","durch ungültigen Sprachschlüssel ersetzen, wenn keine deutschen Texte übernommen werden sollen","Replace by an invalid language key if German descriptions are not wanted","Sprache 1:","DEU","durch ungültigen Sprachschlüssel ersetzen, wenn keine deutschen Texte übernommen werden sollen","Replace by an invalid language key if German descriptions are not wanted","Sprache 1:","DEU","durch ungültigen Sprachschlüssel ersetzen, wenn keine deutschen Texte übernommen werden sollen","Replace by an invalid language key if German descriptions are not wanted","Sprache 1:","DEU","durch ungültigen Sprachschlüssel ersetzen, wenn keine deutschen Texte übernommen werden sollen","Replace by an invalid language key if German descriptions are not wanted","Sprache 1:","DEU","durch ungültigen Sprachschlüssel ersetzen, wenn keine deutschen Texte übernommen werden sollen","Replace by an invalid language key if German descriptions are not wanted","Sprache 1:","DEU","durch ungültigen Sprachschlüssel ersetzen, wenn keine deutschen Texte übernommen werden sollen","Replace by an invalid language key if German descriptions are not wanted","Sprache 1:","DEU","durch ungültigen Sprachschlüssel ersetzen, wenn keine deutschen Texte übernommen werden sollen","Replace by an invalid language key if German descriptions are not wanted","Sprache 1:","DEU","durch ungültigen Sprachschlüssel ersetzen, wenn keine deutschen Texte übernommen werden sollen","Replace by an invalid language key if German descriptions are not wanted","Sprache 1:","DEU","durch ungültigen Sprachschlüssel ersetzen, wenn keine deutschen Texte übernommen werden sollen","Replace by an invalid language key if German descriptions are not wanted","Sprache 1:","DEU","durch ungültigen Sprachschlüssel ersetzen, wenn keine deutschen Texte übernommen werden sollen","Replace by an invalid language key if German descriptions are not wanted","Sprache 1:","DEU","durch ungültigen Sprachschlüssel ersetzen, wenn keine deutschen Texte übernommen werden sollen","Replace by an invalid language key if German descriptions are not wanted","Sprache 1:","DEU","durch ungültigen Sprachschlüssel ersetzen, wenn keine deutschen Texte übernommen werden sollen","Replace by an invalid language key if German descriptions are not wanted","Sprache 1:","DEU","durch ungültigen Sprachschlüssel ersetzen, wenn keine deutschen Texte übernommen werden sollen","Replace by an invalid language key if German descriptions are not wanted","Sprache 1:","DEU","durch ungültigen Sprachschlüssel ersetzen, wenn keine deutschen Texte übernommen werden sollen","Replace by an invalid language key if German descriptions are not wanted","Sprache 1:","DEU","durch ungültigen Sprachschlüssel ersetzen, wenn keine deutschen Texte übernommen werden sollen","Replace by an invalid language key if German descriptions are not wanted","Sprache 1:","DEU","durch ungültigen Sprachschlüssel ersetzen, wenn keine deutschen Texte übernommen werden sollen","Replace by an invalid language key if German descriptions are not wanted","Sprache 1:","DEU","durch ungültigen Sprachschlüssel ersetzen, wenn keine deutschen Texte übernommen werden sollen","Replace by an invalid language key if German descriptions are not wanted","Sprache 1:","DEU","durch ungültigen Sprachschlüssel ersetzen, wenn keine deutschen Texte übernommen werden sollen","Replace by an invalid language key if German descriptions are not wanted","Sprache 1:","DEU","durch ungültigen Sprachschlüssel ersetzen, wenn keine deutschen Texte übernommen werden sollen","Replace by an invalid language key if German descriptions are not wanted","Sprache 1:","DEU","durch ungültigen Sprachschlüssel ersetzen, wenn keine deutschen Texte übernommen werden sollen","Replace by an invalid language key if German descriptions are not wanted","Sprache 1:","DEU","durch ungültigen Sprachschlüssel ersetzen, wenn keine deutschen Texte übernommen werden sollen","Replace by an invalid language key if German descriptions are not wanted","Sprache 1:","DEU","durch ungültigen Sprachschlüssel ersetzen, wenn keine deutschen Texte übernommen werden sollen","Replace by an invalid language key if German descriptions are not wanted","Sprache 1:","DEU","durch ungültigen Sprachschlüssel ersetzen, wenn keine deutschen Texte übernommen werden sollen","Replace by an invalid language key if German descriptions are not wanted","Sprache 1:","DEU","durch ungültigen Sprachschlüssel ersetzen, wenn keine deutschen Texte übernommen werden sollen","Replace by an invalid language key if German descriptions are not wanted","Sprache 1:","DEU","durch ungültigen Sprachschlüssel ersetzen, wenn keine deutschen Texte übernommen werden sollen","Replace by an invalid language key if German descriptions are not wanted","Sprache 1:","DEU","durch ungültigen Sprachschlüssel ersetzen, wenn keine deutschen Texte übernommen werden sollen","Replace by an invalid language key if German descriptions are not wanted","Sprache 1:","DEU","durch ungültigen Sprachschlüssel ersetzen, wenn keine deutschen Texte übernommen werden sollen","Replace by an invalid language key if German descriptions are not wanted","Sprache 1:","DEU","durch ungültigen Sprachschlüssel ersetzen, wenn keine deutschen Texte übernommen werden sollen","Replace by an invalid language key if German descriptions are not wanted","Sprache 1:","DEU","durch ungültigen Sprachschlüssel ersetzen, wenn keine deutschen Texte übernommen werden sollen","Replace by an invalid language key if German descriptions are not wanted","Sprache 1:","DEU","durch ungültigen Sprachschlüssel ersetzen, wenn keine deutschen Texte übernommen werden sollen","Replace by an invalid language key if German descriptions are not wanted","Sprache 1:","DEU","durch ungültigen Sprachschlüssel ersetzen, wenn keine deutschen Texte übernommen werden sollen","Replace by an invalid language key if German descriptions are not wanted","Sprache 1:","DEU","durch ungültigen Sprachschlüssel ersetzen, wenn keine deutschen Texte übernommen werden sollen","Replace by an invalid language key if German descriptions are not wanted","Sprache 1:","DEU","durch ungültigen Sprachschlüssel ersetzen, wenn keine deutschen Texte übernommen werden sollen","Replace by an invalid language key if German descriptions are not wanted","Sprache 1:","DEU","durch ungültigen Sprachschlüssel ersetzen, wenn keine deutschen Texte übernommen werden sollen","Replace by an invalid language key if German descriptions are not wanted","Sprache 1:","DEU","durch ungültigen Sprachschlüssel ersetzen, wenn keine deutschen Texte übernommen werden sollen","Replace by an invalid language key if German descriptions are not wanted","Sprache 1:","DEU","durch ungültigen Sprachschlüssel ersetzen, wenn keine deutschen Texte übernommen werden sollen","Replace by an invalid language key if German descriptions are not wanted","Sprache 1:","DEU","durch ungültigen Sprachschlüssel ersetzen, wenn keine deutschen Texte übernommen werden sollen","Replace by an invalid language key if German descriptions are not wanted","Sprache 1:","DEU","durch ungültigen Sprachschlüssel ersetzen, wenn keine deutschen Texte übernommen werden sollen","Replace by an invalid language key if German descriptions are not wanted","Sprache 1:","DEU","durch ungültigen Sprachschlüssel ersetzen, wenn keine deutschen Texte übernommen werden sollen","Replace by an invalid language key if German descriptions are not wanted","Sprache 1:","DEU","durch ungültigen Sprachschlüssel ersetzen, wenn keine deutschen Texte übernommen werden sollen","Replace by an invalid language key if German descriptions are not wanted","Sprache 1:","DEU","durch ungültigen Sprachschlüssel ersetzen, wenn keine deutschen Texte übernommen werden sollen","Replace by an invalid language key if German descriptions are not wanted","Sprache 1:","DEU","durch ungültigen Sprachschlüssel ersetzen, wenn keine deutschen Texte übernommen werden sollen","Replace by an invalid language key if German descriptions are not wanted","Sprache 1:","DEU","durch ungültigen Sprachschlüssel ersetzen, wenn keine deutschen Texte übernommen werden sollen","Replace by an invalid language key if German descriptions are not wanted","Sprache 1:","DEU","durch ungültigen Sprachschlüssel ersetzen, wenn keine deutschen Texte übernommen werden sollen","Replace by an invalid language key if German descriptions are not wanted","Sprache 1:","DEU","durch ungültigen Sprachschlüssel ersetzen, wenn keine deutschen Texte übernommen werden sollen","Replace by an invalid language key if German descriptions are not wanted","Sprache 1:","DEU","durch ungültigen Sprachschlüssel ersetzen, wenn keine deutschen Texte übernommen werden sollen","Replace by an invalid language key if German descriptions are not wanted","Sprache 1:","DEU","durch ungültigen Sprachschlüssel ersetzen, wenn keine deutschen Texte übernommen werden sollen","Replace by an invalid language key if German descriptions are not wanted","Sprache 1:","DEU","durch ungültigen Sprachschlüssel ersetzen, wenn keine deutschen Texte übernommen werden sollen","Replace by an invalid language key if German descriptions are not wanted","Sprache 1:","DEU","durch ungültigen Sprachschlüssel ersetzen, wenn keine deutschen Texte übernommen werden sollen","Replace by an invalid language key if German descriptions are not wanted","Sprache 1:","DEU","durch ungültigen Sprachschlüssel ersetzen, wenn keine deutschen Texte übernommen werden sollen","Replace by an invalid language key if German descriptions are not wanted","Sprache 1:","DEU","durch ungültigen Sprachschlüssel ersetzen, wenn keine deutschen Texte übernommen werden sollen","Replace by an invalid language key if German descriptions are not wanted","Sprache 1:","DEU","durch ungültigen Sprachschlüssel ersetzen, wenn keine deutschen Texte übernommen werden sollen","Replace by an invalid language key if German descriptions are not wanted","Sprache 1:","DEU","durch ungültigen Sprachschlüssel ersetzen, wenn keine deutschen Texte übernommen werden sollen","Replace by an invalid language key if German descriptions are not wanted","Sprache 1:","DEU","durch ungültigen Sprachschlüssel ersetzen, wenn keine deutschen Texte übernommen werden sollen","Replace by an invalid language key if German descriptions are not wanted","Sprache 1:","DEU","durch ungültigen Sprachschlüssel ersetzen, wenn keine deutschen Texte übernommen werden sollen","Replace by an invalid language key if German descriptions are not wanted","Sprache 1:","DEU","durch ungültigen Sprachschlüssel ersetzen, wenn keine deutschen Texte übernommen werden sollen","Replace by an invalid language key if German descriptions are not wanted","Sprache 1:","DEU","durch ungültigen Sprachschlüssel ersetzen, wenn keine deutschen Texte übernommen werden sollen","Replace by an invalid language key if German descriptions are not wanted","Sprache 1:","DEU","durch ungültigen Sprachschlüssel ersetzen, wenn keine deutschen Texte übernommen werden sollen","Replace by an invalid language key if German descriptions are not wanted","Sprache 1:","DEU","durch ungültigen Sprachschlüssel ersetzen, wenn keine deutschen Texte übernommen werden sollen","Replace by an invalid language key if German descriptions are not wanted","Sprache 1:","DEU","durch ungültigen Sprachschlüssel ersetzen, wenn keine deutschen Texte übernommen werden sollen","Replace by an invalid language key if German descriptions are not wanted","Sprache 1:","DEU","durch ungültigen Sprachschlüssel ersetzen, wenn keine deutschen Texte übernommen werden sollen","Replace by an invalid language key if German descriptions are not wanted","Sprache 1:","DEU","durch ungültigen Sprachschlüssel ersetzen, wenn keine deutschen Texte übernommen werden sollen","Replace by an invalid language key if German descriptions are not wanted","Sprache 1:","DEU","durch ungültigen Sprachschlüssel ersetzen, wenn keine deutschen Texte übernommen werden sollen","Replace by an invalid language key if German descriptions are not wanted","Sprache 1:","DEU","durch ungültigen Sprachschlüssel ersetzen, wenn keine deutschen Texte übernommen werden sollen","Replace by an invalid language key if German descriptions are not wanted","Sprache 1:","DEU","durch ungültigen Sprachschlüssel ersetzen, wenn keine deutschen Texte übernommen werden sollen","Replace by an invalid language key if German descriptions are not wanted","Sprache 1:","DEU","durch ungültigen Sprachschlüssel ersetzen, wenn keine deutschen Texte übernommen werden sollen","Replace by an invalid language key if German descriptions are not wanted","Sprache 1:","DEU","durch ungültigen Sprachschlüssel ersetzen, wenn keine deutschen Texte übernommen werden sollen","Replace by an invalid language key if German descriptions are not wanted","Sprache 1:","DEU","durch ungültigen Sprachschlüssel ersetzen, wenn keine deutschen Texte übernommen werden sollen","Replace by an invalid language key if German descriptions are not wanted","Sprache 1:","DEU","durch ungültigen Sprachschlüssel ersetzen, wenn keine deutschen Texte übernommen werden sollen","Replace by an invalid language key if German descriptions are not wanted","Sprache 1:","DEU","durch ungültigen Sprachschlüssel ersetzen, wenn keine deutschen Texte übernommen werden sollen","Replace by an invalid language key if German descriptions are not wanted","Sprache 1:","DEU","durch ungültigen Sprachschlüssel ersetzen, wenn keine deutschen Texte übernommen werden sollen","Replace by an invalid language key if German descriptions are not wanted","Sprache 1:","DEU","durch ungültigen Sprachschlüssel ersetzen, wenn keine deutschen Texte übernommen werden sollen","Replace by an invalid language key if German descriptions are not wanted","Sprache 1:","DEU","durch ungültigen Sprachschlüssel ersetzen, wenn keine deutschen Texte übernommen werden sollen","Replace by an invalid language key if German descriptions are not wanted","Sprache 1:","DEU","durch ungültigen Sprachschlüssel ersetzen, wenn keine deutschen Texte übernommen werden sollen","Replace by an invalid language key if German descriptions are not wanted","Sprache 1:","DEU","durch ungültigen Sprachschlüssel ersetzen, wenn keine deutschen Texte übernommen werden sollen","Replace by an invalid language key if German descriptions are not wanted","Sprache 1:","DEU","durch ungültigen Sprachschlüssel ersetzen, wenn keine deutschen Texte übernommen werden sollen","Replace by an invalid language key if German descriptions are not wanted","Sprache 1:","DEU","durch ungültigen Sprachschlüssel ersetzen, wenn keine deutschen Texte übernommen werden sollen","Replace by an invalid language key if German descriptions are not wanted","Sprache 1:","DEU","durch ungültigen Sprachschlüssel ersetzen, wenn keine deutschen Texte übernommen werden sollen","Replace by an invalid language key if German descriptions are not wanted","Sprache 1:","DEU","durch ungültigen Sprachschlüssel ersetzen, wenn keine deutschen Texte übernommen werden sollen","Replace by an invalid language key if German descriptions are not wanted","Sprache 1:","DEU","durch ungültigen Sprachschlüssel ersetzen, wenn keine deutschen Texte übernommen werden sollen","Replace by an invalid language key if German descriptions are not wanted","Sprache 1:","DEU","durch ungültigen Sprachschlüssel ersetzen, wenn keine deutschen Texte übernommen werden sollen","Replace by an invalid language key if German descriptions are not wanted","Sprache 1:","DEU","durch ungültigen Sprachschlüssel ersetzen, wenn keine deutschen Texte übernommen werden sollen","Replace by an invalid language key if German descriptions are not wanted","Sprache 1:","DEU","durch ungültigen Sprachschlüssel ersetzen, wenn keine deutschen Texte übernommen werden sollen","Replace by an invalid language key if German descriptions are not wanted","Sprache 1:","DEU","durch ungültigen Sprachschlüssel ersetzen, wenn keine deutschen Texte übernommen werden sollen","Replace by an invalid language key if German descriptions are not wanted","Sprache 1:","DEU","durch ungültigen Sprachschlüssel ersetzen, wenn keine deutschen Texte übernommen werden sollen","Replace by an invalid language key if German descriptions are not wanted","Sprache 1:","DEU","durch ungültigen Sprachschlüssel ersetzen, wenn keine deutschen Texte übernommen werden sollen","Replace by an invalid language key if German descriptions are not wanted","Sprache 1:","DEU","durch ungültigen Sprachschlüssel ersetzen, wenn keine deutschen Texte übernommen werden sollen","Replace by an invalid language key if German descriptions are not wanted","Sprache 1:","DEU","durch ungültigen Sprachschlüssel ersetzen, wenn keine deutschen Texte übernommen werden sollen","Replace by an invalid language key if German descriptions are not wanted","Sprache 1:","DEU","durch ungültigen Sprachschlüssel ersetzen, wenn keine deutschen Texte übernommen werden sollen","Replace by an invalid language key if German descriptions are not wanted","Sprache 1:","DEU","durch ungültigen Sprachschlüssel ersetzen, wenn keine deutschen Texte übernommen werden sollen","Replace by an invalid language key if German descriptions are not wanted","Sprache 1:","DEU","durch ungültigen Sprachschlüssel ersetzen, wenn keine deutschen Texte übernommen werden sollen","Replace by an invalid language key if German descriptions are not wanted","Sprache 1:","DEU","durch ungültigen Sprachschlüssel ersetzen, wenn keine deutschen Texte übernommen werden sollen","Replace by an invalid language key if German descriptions are not wanted","Sprache 1:","DEU","durch ungültigen Sprachschlüssel ersetzen, wenn keine deutschen Texte übernommen werden sollen","Replace by an invalid language key if German descriptions are not wanted","Sprache 1:","DEU","durch ungültigen Sprachschlüssel ersetzen, wenn keine deutschen Texte übernommen werden sollen","Replace by an invalid language key if German descriptions are not wanted","Sprache 1:","DEU","durch ungültigen Sprachschlüssel ersetzen, wenn keine deutschen Texte übernommen werden sollen","Replace by an invalid language key if German descriptions are not wanted","Sprache 1:","DEU","durch ungültigen Sprachschlüssel ersetzen, wenn keine deutschen Texte übernommen werden sollen","Replace by an invalid language key if German descriptions are not wanted","Sprache 1:","DEU","durch ungültigen Sprachschlüssel ersetzen, wenn keine deutschen Texte übernommen werden sollen","Replace by an invalid language key if German descriptions are not wanted","Sprache 1:","DEU","durch ungültigen Sprachschlüssel ersetzen, wenn keine deutschen Texte übernommen werden sollen","Replace by an invalid language key if German descriptions are not wanted","Sprache 1:","DEU","durch ungültigen Sprachschlüssel ersetzen, wenn keine deutschen Texte übernommen werden sollen","Replace by an invalid language key if German descriptions are not wanted","Sprache 1:","DEU","durch ungültigen Sprachschlüssel ersetzen, wenn keine deutschen Texte übernommen werden sollen","Replace by an invalid language key if German descriptions are not wanted","Sprache 1:","DEU","durch ungültigen Sprachschlüssel ersetzen, wenn keine deutschen Texte übernommen werden sollen","Replace by an invalid language key if German descriptions are not wanted","Sprache 1:","DEU","durch ungültigen Sprachschlüssel ersetzen, wenn keine deutschen Texte übernommen werden sollen","Replace by an invalid language key if German descriptions are not wanted","Sprache 1:","DEU","durch ungültigen Sprachschlüssel ersetzen, wenn keine deutschen Texte übernommen werden sollen","Replace by an invalid language key if German descriptions are not wanted","Sprache 1:","DEU","durch ungültigen Sprachschlüssel ersetzen, wenn keine deutschen Texte übernommen werden sollen","Replace by an invalid language key if German descriptions are not wanted","Sprache 1:","DEU","durch ungültigen Sprachschlüssel ersetzen, wenn keine deutschen Texte übernommen werden sollen","Replace by an invalid language key if German descriptions are not wanted","Sprache 1:","DEU","durch ungültigen Sprachschlüssel ersetzen, wenn keine deutschen Texte übernommen werden sollen","Replace by an invalid language key if German descriptions are not wanted","Sprache 1:","DEU","durch ungültigen Sprachschlüssel ersetzen, wenn keine deutschen Texte übernommen werden sollen","Replace by an invalid language key if German descriptions are not wanted","Sprache 1:","DEU","durch ungültigen Sprachschlüssel ersetzen, wenn keine deutschen Texte übernommen werden sollen","Replace by an invalid language key if German descriptions are not wanted","Sprache 1:","DEU","durch ungültigen Sprachschlüssel ersetzen, wenn keine deutschen Texte übernommen werden sollen","Replace by an invalid language key if German descriptions are not wanted","Sprache 1:","DEU","durch ungültigen Sprachschlüssel ersetzen, wenn keine deutschen Texte übernommen werden sollen","Replace by an invalid language key if German descriptions are not wanted","Sprache 1:","DEU","durch ungültigen Sprachschlüssel ersetzen, wenn keine deutschen Texte übernommen werden sollen","Replace by an invalid language key if German descriptions are not wanted","Sprache 1:","DEU","durch ungültigen Sprachschlüssel ersetzen, wenn keine deutschen Texte übernommen werden sollen","Replace by an invalid language key if German descriptions are not wanted","Sprache 1:","DEU","durch ungültigen Sprachschlüssel ersetzen, wenn keine deutschen Texte übernommen werden sollen","Replace by an invalid language key if German descriptions are not wanted","Sprache 1:","DEU","durch ungültigen Sprachschlüssel ersetzen, wenn keine deutschen Texte übernommen werden sollen","Replace by an invalid language key if German descriptions are not wanted","Sprache 1:","DEU","durch ungültigen Sprachschlüssel ersetzen, wenn keine deutschen Texte übernommen werden sollen","Replace by an invalid language key if German descriptions are not wanted","Sprache 1:","DEU","durch ungültigen Sprachschlüssel ersetzen, wenn keine deutschen Texte übernommen werden sollen","Replace by an invalid language key if German descriptions are not wanted","Sprache 1:","DEU","durch ungültigen Sprachschlüssel ersetzen, wenn keine deutschen Texte übernommen werden sollen","Replace by an invalid language key if German descriptions are not wanted","Sprache 1:","DEU","durch ungültigen Sprachschlüssel ersetzen, wenn keine deutschen Texte übernommen werden sollen","Replace by an invalid language key if German descriptions are not wanted","Sprache 1:","DEU","durch ungültigen Sprachschlüssel ersetzen, wenn keine deutschen Texte übernommen werden sollen","Replace by an invalid language key if German descriptions are not wanted","Sprache 1:","DEU","durch ungültigen Sprachschlüssel ersetzen, wenn keine deutschen Texte übernommen werden sollen","Replace by an invalid language key if German descriptions are not wanted","Sprache 1:","DEU","durch ungültigen Sprachschlüssel ersetzen, wenn keine deutschen Texte übernommen werden sollen","Replace by an invalid language key if German descriptions are not wanted","Sprache 1:","DEU","durch ungültigen Sprachschlüssel ersetzen, wenn keine deutschen Texte übernommen werden sollen","Replace by an invalid language key if German descriptions are not wanted","Sprache 1:","DEU","durch ungültigen Sprachschlüssel ersetzen, wenn keine deutschen Texte übernommen werden sollen","Replace by an invalid language key if German descriptions are not wanted","Sprache 1:","DEU","durch ungültigen Sprachschlüssel ersetzen, wenn keine deutschen Texte übernommen werden sollen","Replace by an invalid language key if German descriptions are not wanted","Sprache 1:","DEU","durch ungültigen Sprachschlüssel ersetzen, wenn keine deutschen Texte übernommen werden sollen","Replace by an invalid language key if German descriptions are not wanted","Sprache 1:","DEU","durch ungültigen Sprachschlüssel ersetzen, wenn keine deutschen Texte übernommen werden sollen","Replace by an invalid language key if German descriptions are not wanted","Sprache 1:","DEU","durch ungültigen Sprachschlüssel ersetzen, wenn keine deutschen Texte übernommen werden sollen","Replace by an invalid language key if German descriptions are not wanted","Sprache 1:","DEU","durch ungültigen Sprachschlüssel ersetzen, wenn keine deutschen Texte übernommen werden sollen","Replace by an invalid language key if German descriptions are not wanted","Sprache 1:","DEU","durch ungültigen Sprachschlüssel ersetzen, wenn keine deutschen Texte übernommen werden sollen","Replace by an invalid language key if German descriptions are not wanted","Sprache 1:","DEU","durch ungültigen Sprachschlüssel ersetzen, wenn keine deutschen Texte übernommen werden sollen","Replace by an invalid language key if German descriptions are not wanted","Sprache 1:","DEU","durch ungültigen Sprachschlüssel ersetzen, wenn keine deutschen Texte übernommen werden sollen","Replace by an invalid language key if German descriptions are not wanted","Sprache 1:","DEU","durch ungültigen Sprachschlüssel ersetzen, wenn keine deutschen Texte übernommen werden sollen","Replace by an invalid language key if German descriptions are not wanted","Sprache 1:","DEU","durch ungültigen Sprachschlüssel ersetzen, wenn keine deutschen Texte übernommen werden sollen","Replace by an invalid language key if German descriptions are not wanted","Sprache 1:","DEU","durch ungültigen Sprachschlüssel ersetzen, wenn keine deutschen Texte übernommen werden sollen","Replace by an invalid language key if German descriptions are not wanted","Sprache 1:","DEU","durch ungültigen Sprachschlüssel ersetzen, wenn keine deutschen Texte übernommen werden sollen","Replace by an invalid language key if German descriptions are not wanted","Sprache 1:","DEU","durch ungültigen Sprachschlüssel ersetzen, wenn keine deutschen Texte übernommen werden sollen","Replace by an invalid language key if German descriptions are not wanted","Sprache 1:","DEU","durch ungültigen Sprachschlüssel ersetzen, wenn keine deutschen Texte übernommen werden sollen","Replace by an invalid language key if German descriptions are not wanted","Sprache 1:","DEU","durch ungültigen Sprachschlüssel ersetzen, wenn keine deutschen Texte übernommen werden sollen","Replace by an invalid language key if German descriptions are not wanted","Sprache 1:","DEU","durch ungültigen Sprachschlüssel ersetzen, wenn keine deutschen Texte übernommen werden sollen","Replace by an invalid language key if German descriptions are not wanted","Sprache 1:","DEU","durch ungültigen Sprachschlüssel ersetzen, wenn keine deutschen Texte übernommen werden sollen","Replace by an invalid language key if German descriptions are not wanted","Sprache 1:","DEU","durch ungültigen Sprachschlüssel ersetzen, wenn keine deutschen Texte übernommen werden sollen","Replace by an invalid language key if German descriptions are not wanted","Sprache 1:","DEU","durch ungültigen Sprachschlüssel ersetzen, wenn keine deutschen Texte übernommen werden sollen","Replace by an invalid language key if German descriptions are not wanted","Sprache 1:","DEU","durch ungültigen Sprachschlüssel ersetzen, wenn keine deutschen Texte übernommen werden sollen","Replace by an invalid language key if German descriptions are not wanted","Sprache 1:","DEU","durch ungültigen Sprachschlüssel ersetzen, wenn keine deutschen Texte übernommen werden sollen","Replace by an invalid language key if German descriptions are not wanted","Sprache 1:","DEU","durch ungültigen Sprachschlüssel ersetzen, wenn keine deutschen Texte übernommen werden sollen","Replace by an invalid language key if German descriptions are not wanted","Sprache 1:","DEU","durch ungültigen Sprachschlüssel ersetzen, wenn keine deutschen Texte übernommen werden sollen","Replace by an invalid language key if German descriptions are not wanted","Sprache 1:","DEU","durch ungültigen Sprachschlüssel ersetzen, wenn keine deutschen Texte übernommen werden sollen","Replace by an invalid language key if German descriptions are not wanted","Sprache 1:","DEU","durch ungültigen Sprachschlüssel ersetzen, wenn keine deutschen Texte übernommen werden sollen","Replace by an invalid language key if German descriptions are not wanted","Sprache 1:","DEU","durch ungültigen Sprachschlüssel ersetzen, wenn keine deutschen Texte übernommen werden sollen","Replace by an invalid language key if German descriptions are not wanted","Sprache 1:","DEU","durch ungültigen Sprachschlüssel ersetzen, wenn keine deutschen Texte übernommen werden sollen","Replace by an invalid language key if German descriptions are not wanted","Sprache 1:","DEU","durch ungültigen Sprachschlüssel ersetzen, wenn keine deutschen Texte übernommen werden sollen","Replace by an invalid language key if German descriptions are not wanted","Sprache 1:","DEU","durch ungültigen Sprachschlüssel ersetzen, wenn keine deutschen Texte übernommen werden sollen","Replace by an invalid language key if German descriptions are not wanted","Sprache 1:","DEU","durch ungültigen Sprachschlüssel ersetzen, wenn keine deutschen Texte übernommen werden sollen","Replace by an invalid language key if German descriptions are not wanted","Sprache 1:","DEU","durch ungültigen Sprachschlüssel ersetzen, wenn keine deutschen Texte übernommen werden sollen","Replace by an invalid language key if German descriptions are not wanted","Sprache 1:","DEU","durch ungültigen Sprachschlüssel ersetzen, wenn keine deutschen Texte übernommen werden sollen","Replace by an invalid language key if German descriptions are not wanted","Sprache 1:","DEU","durch ungültigen Sprachschlüssel ersetzen, wenn keine deutschen Texte übernommen werden sollen","Replace by an invalid language key if German descriptions are not wanted","Sprache 1:","DEU","durch ungültigen Sprachschlüssel ersetzen, wenn keine deutschen Texte übernommen werden sollen","Replace by an invalid language key if German descriptions are not wanted","Sprache 1:","DEU","durch ungültigen Sprachschlüssel ersetzen, wenn keine deutschen Texte übernommen werden sollen","Replace by an invalid language key if German descriptions are not wanted","Sprache 1:","DEU","durch ungültigen Sprachschlüssel ersetzen, wenn keine deutschen Texte übernommen werden sollen","Replace by an invalid language key if German descriptions are not wanted","Sprache 1:","DEU","durch ungültigen Sprachschlüssel ersetzen, wenn keine deutschen Texte übernommen werden sollen","Replace by an invalid language key if German descriptions are not wanted","Sprache 1:","DEU","durch ungültigen Sprachschlüssel ersetzen, wenn keine deutschen Texte übernommen werden sollen","Replace by an invalid language key if German descriptions are not wanted","Sprache 1:","DEU","durch ungültigen Sprachschlüssel ersetzen, wenn keine deutschen Texte übernommen werden sollen","Replace by an invalid language key if German descriptions are not wanted","Sprache 1:","DEU","durch ungültigen Sprachschlüssel ersetzen, wenn keine deutschen Texte übernommen werden sollen","Replace by an invalid language key if German descriptions are not wanted","Sprache 1:","DEU","durch ungültigen Sprachschlüssel ersetzen, wenn keine deutschen Texte übernommen werden sollen","Replace by an invalid language key if German descriptions are not wanted","Sprache 1:","DEU","durch ungültigen Sprachschlüssel ersetzen, wenn keine deutschen Texte übernommen werden sollen","Replace by an invalid language key if German descriptions are not wanted","Sprache 1:","DEU","durch ungültigen Sprachschlüssel ersetzen, wenn keine deutschen Texte übernommen werden sollen","Replace by an invalid language key if German descriptions are not wanted","Sprache 1:","DEU","durch ungültigen Sprachschlüssel ersetzen, wenn keine deutschen Texte übernommen werden sollen","Replace by an invalid language key if German descriptions are not wanted","Sprache 1:","DEU","durch ungültigen Sprachschlüssel ersetzen, wenn keine deutschen Texte übernommen werden sollen","Replace by an invalid language key if German descriptions are not wanted","Sprache 1:","DEU","durch ungültigen Sprachschlüssel ersetzen, wenn keine deutschen Texte übernommen werden sollen","Replace by an invalid language key if German descriptions are not wanted","Sprache 1:","DEU","durch ungültigen Sprachschlüssel ersetzen, wenn keine deutschen Texte übernommen werden sollen","Replace by an invalid language key if German descriptions are not wanted","Sprache 1:","DEU","durch ungültigen Sprachschlüssel ersetzen, wenn keine deutschen Texte übernommen werden sollen","Replace by an invalid language key if German descriptions are not wanted","Sprache 1:","DEU","durch ungültigen Sprachschlüssel ersetzen, wenn keine deutschen Texte übernommen werden sollen","Replace by an invalid language key if German descriptions are not wanted","Sprache 1:","DEU","durch ungültigen Sprachschlüssel ersetzen, wenn keine deutschen Texte übernommen werden sollen","Replace by an invalid language key if German descriptions are not wanted","Sprache 1:","DEU","durch ungültigen Sprachschlüssel ersetzen, wenn keine deutschen Texte übernommen werden sollen","Replace by an invalid language key if German descriptions are not wanted","Sprache 1:","DEU","durch ungültigen Sprachschlüssel ersetzen, wenn keine deutschen Texte übernommen werden sollen","Replace by an invalid language key if German descriptions are not wanted","Sprache 1:","DEU","durch ungültigen Sprachschlüssel ersetzen, wenn keine deutschen Texte übernommen werden sollen","Replace by an invalid language key if German descriptions are not wanted","Sprache 1:","DEU","durch ungültigen Sprachschlüssel ersetzen, wenn keine deutschen Texte übernommen werden sollen","Replace by an invalid language key if German descriptions are not wanted","Sprache 1:","DEU","durch ungültigen Sprachschlüssel ersetzen, wenn keine deutschen Texte übernommen werden sollen","Replace by an invalid language key if German descriptions are not wanted","Sprache 1:","DEU","durch ungültigen Sprachschlüssel ersetzen, wenn keine deutschen Texte übernommen werden sollen","Replace by an invalid language key if German descriptions are not wanted","Sprache 1:","DEU","durch ungültigen Sprachschlüssel ersetzen, wenn keine deutschen Texte übernommen werden sollen","Replace by an invalid language key if German descriptions are not wanted","Sprache 1:","DEU","durch ungültigen Sprachschlüssel ersetzen, wenn keine deutschen Texte übernommen werden sollen","Replace by an invalid language key if German descriptions are not wanted","Sprache 1:","DEU","durch ungültigen Sprachschlüssel ersetzen, wenn keine deutschen Texte übernommen werden sollen","Replace by an invalid language key if German descriptions are not wanted","Sprache 1:","DEU","durch ungültigen Sprachschlüssel ersetzen, wenn keine deutschen Texte übernommen werden sollen","Replace by an invalid language key if German descriptions are not wanted","Sprache 1:","DEU","durch ungültigen Sprachschlüssel ersetzen, wenn keine deutschen Texte übernommen werden sollen","Replace by an invalid language key if German descriptions are not wanted","Sprache 1:","DEU","durch ungültigen Sprachschlüssel ersetzen, wenn keine deutschen Texte übernommen werden sollen","Replace by an invalid language key if German descriptions are not wanted","Sprache 1:","DEU","durch ungültigen Sprachschlüssel ersetzen, wenn keine deutschen Texte übernommen werden sollen","Replace by an invalid language key if German descriptions are not wanted","Sprache 1:","DEU","durch ungültigen Sprachschlüssel ersetzen, wenn keine deutschen Texte übernommen werden sollen","Replace by an invalid language key if German descriptions are not wanted","Sprache 1:","DEU","durch ungültigen Sprachschlüssel ersetzen, wenn keine deutschen Texte übernommen werden sollen","Replace by an invalid language key if German descriptions are not wanted","Sprache 1:","DEU","durch ungültigen Sprachschlüssel ersetzen, wenn keine deutschen Texte übernommen werden sollen","Replace by an invalid language key if German descriptions are not wanted","Sprache 1:","DEU","durch ungültigen Sprachschlüssel ersetzen, wenn keine deutschen Texte übernommen werden sollen","Replace by an invalid language key if German descriptions are not wanted","Sprache 1:","DEU","durch ungültigen Sprachschlüssel ersetzen, wenn keine deutschen Texte übernommen werden sollen","Replace by an invalid language key if German descriptions are not wanted","Sprache 1:","DEU","durch ungültigen Sprachschlüssel ersetzen, wenn keine deutschen Texte übernommen werden sollen","Replace by an invalid language key if German descriptions are not wanted","Sprache 1:","DEU","durch ungültigen Sprachschlüssel ersetzen, wenn keine deutschen Texte übernommen werden sollen","Replace by an invalid language key if German descriptions are not wanted","Sprache 1:","DEU","durch ungültigen Sprachschlüssel ersetzen, wenn keine deutschen Texte übernommen werden sollen","Replace by an invalid language key if German descriptions are not wanted","Sprache 1:","DEU","durch ungültigen Sprachschlüssel ersetzen, wenn keine deutschen Texte übernommen werden sollen","Replace by an invalid language key if German descriptions are not wanted","Sprache 1:","DEU","durch ungültigen Sprachschlüssel ersetzen, wenn keine deutschen Texte übernommen werden sollen","Replace by an invalid language key if German descriptions are not wanted","Sprache 1:","DEU","durch ungültigen Sprachschlüssel ersetzen, wenn keine deutschen Texte übernommen werden sollen","Replace by an invalid language key if German descriptions are not wanted","Sprache 1:","DEU","durch ungültigen Sprachschlüssel ersetzen, wenn keine deutschen Texte übernommen werden sollen","Replace by an invalid language key if German descriptions are not wanted","Sprache 1:","DEU","durch ungültigen Sprachschlüssel ersetzen, wenn keine deutschen Texte übernommen werden sollen","Replace by an invalid language key if German descriptions are not wanted","Sprache 1:","DEU","durch ungültigen Sprachschlüssel ersetzen, wenn keine deutschen Texte übernommen werden sollen","Replace by an invalid language key if German descriptions are not wanted","Sprache 1:","DEU","durch ungültigen Sprachschlüssel ersetzen, wenn keine deutschen Texte übernommen werden sollen","Replace by an invalid language key if German descriptions are not wanted","Sprache 1:","DEU","durch ungültigen Sprachschlüssel ersetzen, wenn keine deutschen Texte übernommen werden sollen","Replace by an invalid language key if German descriptions are not wanted","Sprache 1:","DEU","durch ungültigen Sprachschlüssel ersetzen, wenn keine deutschen Texte übernommen werden sollen","Replace by an invalid language key if German descriptions are not wanted","Sprache 1:","DEU","durch ungültigen Sprachschlüssel ersetzen, wenn keine deutschen Texte übernommen werden sollen","Replace by an invalid language key if German descriptions are not wanted","Sprache 1:","DEU","durch ungültigen Sprachschlüssel ersetzen, wenn keine deutschen Texte übernommen werden sollen","Replace by an invalid language key if German descriptions are not wanted","Sprache 1:","DEU","durch ungültigen Sprachschlüssel ersetzen, wenn keine deutschen Texte übernommen werden sollen","Replace by an invalid language key if German descriptions are not wanted","Sprache 1:","DEU","durch ungültigen Sprachschlüssel ersetzen, wenn keine deutschen Texte übernommen werden sollen","Replace by an invalid language key if German descriptions are not wanted","Sprache 1:","DEU","durch ungültigen Sprachschlüssel ersetzen, wenn keine deutschen Texte übernommen werden sollen","Replace by an invalid language key if German descriptions are not wanted","Sprache 1:","DEU","durch ungültigen Sprachschlüssel ersetzen, wenn keine deutschen Texte übernommen werden sollen","Replace by an invalid language key if German descriptions are not wanted","Sprache 1:","DEU","durch ungültigen Sprachschlüssel ersetzen, wenn keine deutschen Texte übernommen werden sollen","Replace by an invalid language key if German descriptions are not wanted","Sprache 1:","DEU","durch ungültigen Sprachschlüssel ersetzen, wenn keine deutschen Texte übernommen werden sollen","Replace by an invalid language key if German descriptions are not wanted","Sprache 1:","DEU","durch ungültigen Sprachschlüssel ersetzen, wenn keine deutschen Texte übernommen werden sollen","Replace by an invalid language key if German descriptions are not wanted","Sprache 1:","DEU","durch ungültigen Sprachschlüssel ersetzen, wenn keine deutschen Texte übernommen werden sollen","Replace by an invalid language key if German descriptions are not wanted","Sprache 1:","DEU","durch ungültigen Sprachschlüssel ersetzen, wenn keine deutschen Texte übernommen werden sollen","Replace by an invalid language key if German descriptions are not wanted","Sprache 1:","DEU","durch ungültigen Sprachschlüssel ersetzen, wenn keine deutschen Texte übernommen werden sollen","Replace by an invalid language key if German descriptions are not wanted","Sprache 1:","DEU","durch ungültigen Sprachschlüssel ersetzen, wenn keine deutschen Texte übernommen werden sollen","Replace by an invalid language key if German descriptions are not wanted","Sprache 1:","DEU","durch ungültigen Sprachschlüssel ersetzen, wenn keine deutschen Texte übernommen werden sollen","Replace by an invalid language key if German descriptions are not wanted","Sprache 1:","DEU","durch ungültigen Sprachschlüssel ersetzen, wenn keine deutschen Texte übernommen werden sollen","Replace by an invalid language key if German descriptions are not wanted","Sprache 1:","DEU","durch ungültigen Sprachschlüssel ersetzen, wenn keine deutschen Texte übernommen werden sollen","Replace by an invalid language key if German descriptions are not wanted","Sprache 1:","DEU","durch ungültigen Sprachschlüssel ersetzen, wenn keine deutschen Texte übernommen werden sollen","Replace by an invalid language key if German descriptions are not wanted","Sprache 1:","DEU","durch ungültigen Sprachschlüssel ersetzen, wenn keine deutschen Texte übernommen werden sollen","Replace by an invalid language key if German descriptions are not wanted","Sprache 1:","DEU","durch ungültigen Sprachschlüssel ersetzen, wenn keine deutschen Texte übernommen werden sollen","Replace by an invalid language key if German descriptions are not wanted","Sprache 1:","DEU","durch ungültigen Sprachschlüssel ersetzen, wenn keine deutschen Texte übernommen werden sollen","Replace by an invalid language key if German descriptions are not wanted","Sprache 1:","DEU","durch ungültigen Sprachschlüssel ersetzen, wenn keine deutschen Texte übernommen werden sollen","Replace by an invalid language key if German descriptions are not wanted","Sprache 1:","DEU","durch ungültigen Sprachschlüssel ersetzen, wenn keine deutschen Texte übernommen werden sollen","Replace by an invalid language key if German descriptions are not wanted","Sprache 1:","DEU","durch ungültigen Sprachschlüssel ersetzen, wenn keine deutschen Texte übernommen werden sollen","Replace by an invalid language key if German descriptions are not wanted","Sprache 1:","DEU","durch ungültigen Sprachschlüssel ersetzen, wenn keine deutschen Texte übernommen werden sollen","Replace by an invalid language key if German descriptions are not wanted","Sprache 1:","DEU","durch ungültigen Sprachschlüssel ersetzen, wenn keine deutschen Texte übernommen werden sollen","Replace by an invalid language key if German descriptions are not wanted","Sprache 1:","DEU","durch ungültigen Sprachschlüssel ersetzen, wenn keine deutschen Texte übernommen werden sollen","Replace by an invalid language key if German descriptions are not wanted","Sprache 1:","DEU","durch ungültigen Sprachschlüssel ersetzen, wenn keine deutschen Texte übernommen werden sollen","Replace by an invalid language key if German descriptions are not wanted","Sprache 1:","DEU","durch ungültigen Sprachschlüssel ersetzen, wenn keine deutschen Texte übernommen werden sollen","Replace by an invalid language key if German descriptions are not wanted","Sprache 1:","DEU","durch ungültigen Sprachschlüssel ersetzen, wenn keine deutschen Texte übernommen werden sollen","Replace by an invalid language key if German descriptions are not wanted","Sprache 1:","DEU","durch ungültigen Sprachschlüssel ersetzen, wenn keine deutschen Texte übernommen werden sollen","Replace by an invalid language key if German descriptions are not wanted","Sprache 1:","DEU","durch ungültigen Sprachschlüssel ersetzen, wenn keine deutschen Texte übernommen werden sollen","Replace by an invalid language key if German descriptions are not wanted","Sprache 1:","DEU","durch ungültigen Sprachschlüssel ersetzen, wenn keine deutschen Texte übernommen werden sollen","Replace by an invalid language key if German descriptions are not wanted","Sprache 1:","DEU","durch ungültigen Sprachschlüssel ersetzen, wenn keine deutschen Texte übernommen werden sollen","Replace by an invalid language key if German descriptions are not wanted","Sprache 1:","DEU","durch ungültigen Sprachschlüssel ersetzen, wenn keine deutschen Texte übernommen werden sollen","Replace by an invalid language key if German descriptions are not wanted","Sprache 1:","DEU","durch ungültigen Sprachschlüssel ersetzen, wenn keine deutschen Texte übernommen werden sollen","Replace by an invalid language key if German descriptions are not wanted","Sprache 1:","DEU","durch ungültigen Sprachschlüssel ersetzen, wenn keine deutschen Texte übernommen werden sollen","Replace by an invalid language key if German descriptions are not wanted","Sprache 1:","DEU","durch ungültigen Sprachschlüssel ersetzen, wenn keine deutschen Texte übernommen werden sollen","Replace by an invalid language key if German descriptions are not wanted","Sprache 1:","DEU","durch ungültigen Sprachschlüssel ersetzen, wenn keine deutschen Texte übernommen werden sollen","Replace by an invalid language key if German descriptions are not wanted","Sprache 1:","DEU","durch ungültigen Sprachschlüssel ersetzen, wenn keine deutschen Texte übernommen werden sollen","Replace by an invalid language key if German descriptions are not wanted","Sprache 1:","DEU","durch ungültigen Sprachschlüssel ersetzen, wenn keine deutschen Texte übernommen werden sollen","Replace by an invalid language key if German descriptions are not wanted","Sprache 1:","DEU","durch ungültigen Sprachschlüssel ersetzen, wenn keine deutschen Texte übernommen werden sollen","Replace by an invalid language key if German descriptions are not wanted","Sprache 1:","DEU","durch ungültigen Sprachschlüssel ersetzen, wenn keine deutschen Texte übernommen werden sollen","Replace by an invalid language key if German descriptions are not wanted","Sprache 1:","DEU","durch ungültigen Sprachschlüssel ersetzen, wenn keine deutschen Texte übernommen werden sollen","Replace by an invalid language key if German descriptions are not wanted","Sprache 1:","DEU","durch ungültigen Sprachschlüssel ersetzen, wenn keine deutschen Texte übernommen werden sollen","Replace by an invalid language key if German descriptions are not wanted","Sprache 1:","DEU","durch ungültigen Sprachschlüssel ersetzen, wenn keine deutschen Texte übernommen werden sollen","Replace by an invalid language key if German descriptions are not wanted","Sprache 1:","DEU","durch ungültigen Sprachschlüssel ersetzen, wenn keine deutschen Texte übernommen werden sollen","Replace by an invalid language key if German descriptions are not wanted","Sprache 1:","DEU","durch ungültigen Sprachschlüssel ersetzen, wenn keine deutschen Texte übernommen werden sollen","Replace by an invalid language key if German descriptions are not wanted","Sprache 1:","DEU","durch ungültigen Sprachschlüssel ersetzen, wenn keine deutschen Texte übernommen werden sollen","Replace by an invalid language key if German descriptions are not wanted","Sprache 1:","DEU","durch ungültigen Sprachschlüssel ersetzen, wenn keine deutschen Texte übernommen werden sollen","Replace by an invalid language key if German descriptions are not wanted","Sprache 1:","DEU","durch ungültigen Sprachschlüssel ersetzen, wenn keine deutschen Texte übernommen werden sollen","Replace by an invalid language key if German descriptions are not wanted","Sprache 1:","DEU","durch ungültigen Sprachschlüssel ersetzen, wenn keine deutschen Texte übernommen werden sollen","Replace by an invalid language key if German descriptions are not wanted","Sprache 1:","DEU","durch ungültigen Sprachschlüssel ersetzen, wenn keine deutschen Texte übernommen werden sollen","Replace by an invalid language key if German descriptions are not wanted","Sprache 1:","DEU","durch ungültigen Sprachschlüssel ersetzen, wenn keine deutschen Texte übernommen werden sollen","Replace by an invalid language key if German descriptions are not wanted","Sprache 1:","DEU","durch ungültigen Sprachschlüssel ersetzen, wenn keine deutschen Texte übernommen werden sollen","Replace by an invalid language key if German descriptions are not wanted","Sprache 1:","DEU","durch ungültigen Sprachschlüssel ersetzen, wenn keine deutschen Texte übernommen werden sollen","Replace by an invalid language key if German descriptions are not wanted","Sprache 1:","DEU","durch ungültigen Sprachschlüssel ersetzen, wenn keine deutschen Texte übernommen werden sollen","Replace by an invalid language key if German descriptions are not wanted","Sprache 1:","DEU","durch ungültigen Sprachschlüssel ersetzen, wenn keine deutschen Texte übernommen werden sollen","Replace by an invalid language key if German descriptions are not wanted","Sprache 1:","DEU","durch ungültigen Sprachschlüssel ersetzen, wenn keine deutschen Texte übernommen werden sollen","Replace by an invalid language key if German descriptions are not wanted","Sprache 1:","DEU","durch ungültigen Sprachschlüssel ersetzen, wenn keine deutschen Texte übernommen werden sollen","Replace by an invalid language key if German descriptions are not wanted","Sprache 1:","DEU","durch ungültigen Sprachschlüssel ersetzen, wenn keine deutschen Texte übernommen werden sollen","Replace by an invalid language key if German descriptions are not wanted","Sprache 1:","DEU","durch ungültigen Sprachschlüssel ersetzen, wenn keine deutschen Texte übernommen werden sollen","Replace by an invalid language key if German descriptions are not wanted","Sprache 1:","DEU","durch ungültigen Sprachschlüssel ersetzen, wenn keine deutschen Texte übernommen werden sollen","Replace by an invalid language key if German descriptions are not wanted","Sprache 1:","DEU","durch ungültigen Sprachschlüssel ersetzen, wenn keine deutschen Texte übernommen werden sollen","Replace by an invalid language key if German descriptions are not wanted","Sprache 1:","DEU","durch ungültigen Sprachschlüssel ersetzen, wenn keine deutschen Texte übernommen werden sollen","Replace by an invalid language key if German descriptions are not wanted","Sprache 1:","DEU","durch ungültigen Sprachschlüssel ersetzen, wenn keine deutschen Texte übernommen werden sollen","Replace by an invalid language key if German descriptions are not wanted","Sprache 1:","DEU","durch ungültigen Sprachschlüssel ersetzen, wenn keine deutschen Texte übernommen werden sollen","Replace by an invalid language key if German descriptions are not wanted","Sprache 1:","DEU","durch ungültigen Sprachschlüssel ersetzen, wenn keine deutschen Texte übernommen werden sollen","Replace by an invalid language key if German descriptions are not wanted","Sprache 1:","DEU","durch ungültigen Sprachschlüssel ersetzen, wenn keine deutschen Texte übernommen werden sollen","Replace by an invalid language key if German descriptions are not wanted","Sprache 1:","DEU","durch ungültigen Sprachschlüssel ersetzen, wenn keine deutschen Texte übernommen werden sollen","Replace by an invalid language key if German descriptions are not wanted","Sprache 1:","DEU","durch ungültigen Sprachschlüssel ersetzen, wenn keine deutschen Texte übernommen werden sollen","Replace by an invalid language key if German descriptions are not wanted","Sprache 1:","DEU","durch ungültigen Sprachschlüssel ersetzen, wenn keine deutschen Texte übernommen werden sollen","Replace by an invalid language key if German descriptions are not wanted","Sprache 1:","DEU","durch ungültigen Sprachschlüssel ersetzen, wenn keine deutschen Texte übernommen werden sollen","Replace by an invalid language key if German descriptions are not wanted","Sprache 1:","DEU","durch ungültigen Sprachschlüssel ersetzen, wenn keine deutschen Texte übernommen werden sollen","Replace by an invalid language key if German descriptions are not wanted","Sprache 1:","DEU","durch ungültigen Sprachschlüssel ersetzen, wenn keine deutschen Texte übernommen werden sollen","Replace by an invalid language key if German descriptions are not wanted","Sprache 1:","DEU","durch ungültigen Sprachschlüssel ersetzen, wenn keine deutschen Texte übernommen werden sollen","Replace by an invalid language key if German descriptions are not wanted","Sprache 1:","DEU","durch ungültigen Sprachschlüssel ersetzen, wenn keine deutschen Texte übernommen werden sollen","Replace by an invalid language key if German descriptions are not wanted","Sprache 1:","DEU","durch ungültigen Sprachschlüssel ersetzen, wenn keine deutschen Texte übernommen werden sollen","Replace by an invalid language key if German descriptions are not wanted","Sprache 1:","DEU","durch ungültigen Sprachschlüssel ersetzen, wenn keine deutschen Texte übernommen werden sollen","Replace by an invalid language key if German descriptions are not wanted","Sprache 1:","DEU","durch ungültigen Sprachschlüssel ersetzen, wenn keine deutschen Texte übernommen werden sollen","Replace by an invalid language key if German descriptions are not wanted","Sprache 1:","DEU","durch ungültigen Sprachschlüssel ersetzen, wenn keine deutschen Texte übernommen werden sollen","Replace by an invalid language key if German descriptions are not wanted","Sprache 1:","DEU","durch ungültigen Sprachschlüssel ersetzen, wenn keine deutschen Texte übernommen werden sollen","Replace by an invalid language key if German descriptions are not wanted","Sprache 1:","DEU","durch ungültigen Sprachschlüssel ersetzen, wenn keine deutschen Texte übernommen werden sollen","Replace by an invalid language key if German descriptions are not wanted","Sprache 1:","DEU","durch ungültigen Sprachschlüssel ersetzen, wenn keine deutschen Texte übernommen werden sollen","Replace by an invalid language key if German descriptions are not wanted","Sprache 1:","DEU","durch ungültigen Sprachschlüssel ersetzen, wenn keine deutschen Texte übernommen werden sollen","Replace by an invalid language key if German descriptions are not wanted","Sprache 1:","DEU","durch ungültigen Sprachschlüssel ersetzen, wenn keine deutschen Texte übernommen werden sollen","Replace by an invalid language key if German descriptions are not wanted","Sprache 1:","DEU","durch ungültigen Sprachschlüssel ersetzen, wenn keine deutschen Texte übernommen werden sollen","Replace by an invalid language key if German descriptions are not wanted","Sprache 1:","DEU","durch ungültigen Sprachschlüssel ersetzen, wenn keine deutschen Texte übernommen werden sollen","Replace by an invalid language key if German descriptions are not wanted","Sprache 1:","DEU","durch ungültigen Sprachschlüssel ersetzen, wenn keine deutschen Texte übernommen werden sollen","Replace by an invalid language key if German descriptions are not wanted","Sprache 1:","DEU","durch ungültigen Sprachschlüssel ersetzen, wenn keine deutschen Texte übernommen werden sollen","Replace by an invalid language key if German descriptions are not wanted","Sprache 1:","DEU","durch ungültigen Sprachschlüssel ersetzen, wenn keine deutschen Texte übernommen werden sollen","Replace by an invalid language key if German descriptions are not wanted","Sprache 1:","DEU","durch ungültigen Sprachschlüssel ersetzen, wenn keine deutschen Texte übernommen werden sollen","Replace by an invalid language key if German descriptions are not wanted","Sprache 1:","DEU","durch ungültigen Sprachschlüssel ersetzen, wenn keine deutschen Texte übernommen werden sollen","Replace by an invalid language key if German descriptions are not wanted","Sprache 1:","DEU","durch ungültigen Sprachschlüssel ersetzen, wenn keine deutschen Texte übernommen werden sollen","Replace by an invalid language key if German descriptions are not wanted","Sprache 1:","DEU","durch ungültigen Sprachschlüssel ersetzen, wenn keine deutschen Texte übernommen werden sollen","Replace by an invalid language key if German descriptions are not wanted","Sprache 1:","DEU","durch ungültigen Sprachschlüssel ersetzen, wenn keine deutschen Texte übernommen werden sollen","Replace by an invalid language key if German descriptions are not wanted","Sprache 1:","DEU","durch ungültigen Sprachschlüssel ersetzen, wenn keine deutschen Texte übernommen werden sollen","Replace by an invalid language key if German descriptions are not wanted","Sprache 1:","DEU","durch ungültigen Sprachschlüssel ersetzen, wenn keine deutschen Texte übernommen werden sollen","Replace by an invalid language key if German descriptions are not wanted","Sprache 1:","DEU","durch ungültigen Sprachschlüssel ersetzen, wenn keine deutschen Texte übernommen werden sollen","Replace by an invalid language key if German descriptions are not wanted","Sprache 1:","DEU","durch ungültigen Sprachschlüssel ersetzen, wenn keine deutschen Texte übernommen werden sollen","Replace by an invalid language key if German descriptions are not wanted","Sprache 1:","DEU","durch ungültigen Sprachschlüssel ersetzen, wenn keine deutschen Texte übernommen werden sollen","Replace by an invalid language key if German descriptions are not wanted","Sprache 1:","DEU","durch ungültigen Sprachschlüssel ersetzen, wenn keine deutschen Texte übernommen werden sollen","Replace by an invalid language key if German descriptions are not wanted","Sprache 1:","DEU","durch ungültigen Sprachschlüssel ersetzen, wenn keine deutschen Texte übernommen werden sollen","Replace by an invalid language key if German descriptions are not wanted","Sprache 1:","DEU","durch ungültigen Sprachschlüssel ersetzen, wenn keine deutschen Texte übernommen werden sollen","Replace by an invalid language key if German descriptions are not wanted","Sprache 1:","DEU","durch ungültigen Sprachschlüssel ersetzen, wenn keine deutschen Texte übernommen werden sollen","Replace by an invalid language key if German descriptions are not wanted","Sprache 1:","DEU","durch ungültigen Sprachschlüssel ersetzen, wenn keine deutschen Texte übernommen werden sollen","Replace by an invalid language key if German descriptions are not wanted","Sprache 1:","DEU","durch ungültigen Sprachschlüssel ersetzen, wenn keine deutschen Texte übernommen werden sollen","Replace by an invalid language key if German descriptions are not wanted","Sprache 1:","DEU","durch ungültigen Sprachschlüssel ersetzen, wenn keine deutschen Texte übernommen werden sollen","Replace by an invalid language key if German descriptions are not wanted","Sprache 1:","DEU","durch ungültigen Sprachschlüssel ersetzen, wenn keine deutschen Texte übernommen werden sollen","Replace by an invalid language key if German descriptions are not wanted","Sprache 1:","DEU","durch ungültigen Sprachschlüssel ersetzen, wenn keine deutschen Texte übernommen werden sollen","Replace by an invalid language key if German descriptions are not wanted","Sprache 1:","DEU","durch ungültigen Sprachschlüssel ersetzen, wenn keine deutschen Texte übernommen werden sollen","Replace by an invalid language key if German descriptions are not wanted","Sprache 1:","DEU","durch ungültigen Sprachschlüssel ersetzen, wenn keine deutschen Texte übernommen werden sollen","Replace by an invalid language key if German descriptions are not wanted","Sprache 1:","DEU","durch ungültigen Sprachschlüssel ersetzen, wenn keine deutschen Texte übernommen werden sollen","Replace by an invalid language key if German descriptions are not wanted","Sprache 1:","DEU","durch ungültigen Sprachschlüssel ersetzen, wenn keine deutschen Texte übernommen werden sollen","Replace by an invalid language key if German descriptions are not wanted","Sprache 1:","DEU","durch ungültigen Sprachschlüssel ersetzen, wenn keine deutschen Texte übernommen werden sollen","Replace by an invalid language key if German descriptions are not wanted","Sprache 1:","DEU","durch ungültigen Sprachschlüssel ersetzen, wenn keine deutschen Texte übernommen werden sollen","Replace by an invalid language key if German descriptions are not wanted","Sprache 1:","DEU","durch ungültigen Sprachschlüssel ersetzen, wenn keine deutschen Texte übernommen werden sollen","Replace by an invalid language key if German descriptions are not wanted","Sprache 1:","DEU","durch ungültigen Sprachschlüssel ersetzen, wenn keine deutschen Texte übernommen werden sollen","Replace by an invalid language key if German descriptions are not wanted","Sprache 1:","DEU","durch ungültigen Sprachschlüssel ersetzen, wenn keine deutschen Texte übernommen werden sollen","Replace by an invalid language key if German descriptions are not wanted","Sprache 1:","DEU","durch ungültigen Sprachschlüssel ersetzen, wenn keine deutschen Texte übernommen werden sollen","Replace by an invalid language key if German descriptions are not wanted","Sprache 1:","DEU","durch ungültigen Sprachschlüssel ersetzen, wenn keine deutschen Texte übernommen werden sollen","Replace by an invalid language key if German descriptions are not wanted","Sprache 1:","DEU","durch ungültigen Sprachschlüssel ersetzen, wenn keine deutschen Texte übernommen werden sollen","Replace by an invalid language key if German descriptions are not wanted","Sprache 1:","DEU","durch ungültigen Sprachschlüssel ersetzen, wenn keine deutschen Texte übernommen werden sollen","Replace by an invalid language key if German descriptions are not wanted","Sprache 1:","DEU","durch ungültigen Sprachschlüssel ersetzen, wenn keine deutschen Texte übernommen werden sollen","Replace by an invalid language key if German descriptions are not wanted","Sprache 1:","DEU","durch ungültigen Sprachschlüssel ersetzen, wenn keine deutschen Texte übernommen werden sollen","Replace by an invalid language key if German descriptions are not wanted","Sprache 1:","DEU","durch ungültigen Sprachschlüssel ersetzen, wenn keine deutschen Texte übernommen werden sollen","Replace by an invalid language key if German descriptions are not wanted","Sprache 1:","DEU","durch ungültigen Sprachschlüssel ersetzen, wenn keine deutschen Texte übernommen werden sollen","Replace by an invalid language key if German descriptions are not wanted","Sprache 1:","DEU","durch ungültigen Sprachschlüssel ersetzen, wenn keine deutschen Texte übernommen werden sollen","Replace by an invalid language key if German descriptions are not wanted","Sprache 1:","DEU","durch ungültigen Sprachschlüssel ersetzen, wenn keine deutschen Texte übernommen werden sollen","Replace by an invalid language key if German descriptions are not wanted","Sprache 1:","DEU","durch ungültigen Sprachschlüssel ersetzen, wenn keine deutschen Texte übernommen werden sollen","Replace by an invalid language key if German descriptions are not wanted","Sprache 1:","DEU","durch ungültigen Sprachschlüssel ersetzen, wenn keine deutschen Texte übernommen werden sollen","Replace by an invalid language key if German descriptions are not wanted","Sprache 1:","DEU","durch ungültigen Sprachschlüssel ersetzen, wenn keine deutschen Texte übernommen werden sollen","Replace by an invalid language key if German descriptions are not wanted","Sprache 1:","DEU","durch ungültigen Sprachschlüssel ersetzen, wenn keine deutschen Texte übernommen werden sollen","Replace by an invalid language key if German descriptions are not wanted","Sprache 1:","DEU","durch ungültigen Sprachschlüssel ersetzen, wenn keine deutschen Texte übernommen werden sollen","Replace by an invalid language key if German descriptions are not wanted","Sprache 1:","DEU","durch ungültigen Sprachschlüssel ersetzen, wenn keine deutschen Texte übernommen werden sollen","Replace by an invalid language key if German descriptions are not wanted","Sprache 1:","DEU","durch ungültigen Sprachschlüssel ersetzen, wenn keine deutschen Texte übernommen werden sollen","Replace by an invalid language key if German descriptions are not wanted","Sprache 1:","DEU","durch ungültigen Sprachschlüssel ersetzen, wenn keine deutschen Texte übernommen werden sollen","Replace by an invalid language key if German descriptions are not wanted","Sprache 1:","DEU","durch ungültigen Sprachschlüssel ersetzen, wenn keine deutschen Texte übernommen werden sollen","Replace by an invalid language key if German descriptions are not wanted","Sprache 1:","DEU","durch ungültigen Sprachschlüssel ersetzen, wenn keine deutschen Texte übernommen werden sollen","Replace by an invalid language key if German descriptions are not wanted","Sprache 1:","DEU","durch ungültigen Sprachschlüssel ersetzen, wenn keine deutschen Texte übernommen werden sollen","Replace by an invalid language key if German descriptions are not wanted","Sprache 1:","DEU","durch ungültigen Sprachschlüssel ersetzen, wenn keine deutschen Texte übernommen werden sollen","Replace by an invalid language key if German descriptions are not wanted","Sprache 1:","DEU","durch ungültigen Sprachschlüssel ersetzen, wenn keine deutschen Texte übernommen werden sollen","Replace by an invalid language key if German descriptions are not wanted","Sprache 1:","DEU","durch ungültigen Sprachschlüssel ersetzen, wenn keine deutschen Texte übernommen werden sollen","Replace by an invalid language key if German descriptions are not wanted","Sprache 1:","DEU","durch ungültigen Sprachschlüssel ersetzen, wenn keine deutschen Texte übernommen werden sollen","Replace by an invalid language key if German descriptions are not wanted","Sprache 1:","DEU","durch ungültigen Sprachschlüssel ersetzen, wenn keine deutschen Texte übernommen werden sollen","Replace by an invalid language key if German descriptions are not wanted","Sprache 1:","DEU","durch ungültigen Sprachschlüssel ersetzen, wenn keine deutschen Texte übernommen werden sollen","Replace by an invalid language key if German descriptions are not wanted","Sprache 1:","DEU","durch ungültigen Sprachschlüssel ersetzen, wenn keine deutschen Texte übernommen werden sollen","Replace by an invalid language key if German descriptions are not wanted","Sprache 1:","DEU","durch ungültigen Sprachschlüssel ersetzen, wenn keine deutschen Texte übernommen werden sollen","Replace by an invalid language key if German descriptions are not wanted","Sprache 1:","DEU","durch ungültigen Sprachschlüssel ersetzen, wenn keine deutschen Texte übernommen werden sollen","Replace by an invalid language key if German descriptions are not wanted","Sprache 1:","DEU","durch ungültigen Sprachschlüssel ersetzen, wenn keine deutschen Texte übernommen werden sollen","Replace by an invalid language key if German descriptions are not wanted","Sprache 1:","DEU","durch ungültigen Sprachschlüssel ersetzen, wenn keine deutschen Texte übernommen werden sollen","Replace by an invalid language key if German descriptions are not wanted","Sprache 1:","DEU","durch ungültigen Sprachschlüssel ersetzen, wenn keine deutschen Texte übernommen werden sollen","Replace by an invalid language key if German descriptions are not wanted","Sprache 1:","DEU","durch ungültigen Sprachschlüssel ersetzen, wenn keine deutschen Texte übernommen werden sollen","Replace by an invalid language key if German descriptions are not wanted","Sprache 1:","DEU","durch ungültigen Sprachschlüssel ersetzen, wenn keine deutschen Texte übernommen werden sollen","Replace by an invalid language key if German descriptions are not wanted","Sprache 1:","DEU","durch ungültigen Sprachschlüssel ersetzen, wenn keine deutschen Texte übernommen werden sollen","Replace by an invalid language key if German descriptions are not wanted","Sprache 1:","DEU","durch ungültigen Sprachschlüssel ersetzen, wenn keine deutschen Texte übernommen werden sollen","Replace by an invalid language key if German descriptions are not wanted","Sprache 1:","DEU","durch ungültigen Sprachschlüssel ersetzen, wenn keine deutschen Texte übernommen werden sollen","Replace by an invalid language key if German descriptions are not wanted","Sprache 1:","DEU","durch ungültigen Sprachschlüssel ersetzen, wenn keine deutschen Texte übernommen werden sollen","Replace by an invalid language key if German descriptions are not wanted","Sprache 1:","DEU","durch ungültigen Sprachschlüssel ersetzen, wenn keine deutschen Texte übernommen werden sollen","Replace by an invalid language key if German descriptions are not wanted","Sprache 1:","DEU","durch ungültigen Sprachschlüssel ersetzen, wenn keine deutschen Texte übernommen werden sollen","Replace by an invalid language key if German descriptions are not wanted","Sprache 1:","DEU","durch ungültigen Sprachschlüssel ersetzen, wenn keine deutschen Texte übernommen werden sollen","Replace by an invalid language key if German descriptions are not wanted","Sprache 1:","DEU","durch ungültigen Sprachschlüssel ersetzen, wenn keine deutschen Texte übernommen werden sollen","Replace by an invalid language key if German descriptions are not wanted","Sprache 1:","DEU","durch ungültigen Sprachschlüssel ersetzen, wenn keine deutschen Texte übernommen werden sollen","Replace by an invalid language key if German descriptions are not wanted","Sprache 1:","DEU","durch ungültigen Sprachschlüssel ersetzen, wenn keine deutschen Texte übernommen werden sollen","Replace by an invalid language key if German descriptions are not wanted","Sprache 1:","DEU","durch ungültigen Sprachschlüssel ersetzen, wenn keine deutschen Texte übernommen werden sollen","Replace by an invalid language key if German descriptions are not wanted","Sprache 1:","DEU","durch ungültigen Sprachschlüssel ersetzen, wenn keine deutschen Texte übernommen werden sollen","Replace by an invalid language key if German descriptions are not wanted","Sprache 1:","DEU","durch ungültigen Sprachschlüssel ersetzen, wenn keine deutschen Texte übernommen werden sollen","Replace by an invalid language key if German descriptions are not wanted","Sprache 1:","DEU","durch ungültigen Sprachschlüssel ersetzen, wenn keine deutschen Texte übernommen werden sollen","Replace by an invalid language key if German descriptions are not wanted","Sprache 1:","DEU","durch ungültigen Sprachschlüssel ersetzen, wenn keine deutschen Texte übernommen werden sollen","Replace by an invalid language key if German descriptions are not wanted","Sprache 1:","DEU","durch ungültigen Sprachschlüssel ersetzen, wenn keine deutschen Texte übernommen werden sollen","Replace by an invalid language key if German descriptions are not wanted","Sprache 1:","DEU","durch ungültigen Sprachschlüssel ersetzen, wenn keine deutschen Texte übernommen werden sollen","Replace by an invalid language key if German descriptions are not wanted","Sprache 1:","DEU","durch ungültigen Sprachschlüssel ersetzen, wenn keine deutschen Texte übernommen werden sollen","Replace by an invalid language key if German descriptions are not wanted","Sprache 1:","DEU","durch ungültigen Sprachschlüssel ersetzen, wenn keine deutschen Texte übernommen werden sollen","Replace by an invalid language key if German descriptions are not wanted","Sprache 1:","DEU","durch ungültigen Sprachschlüssel ersetzen, wenn keine deutschen Texte übernommen werden sollen","Replace by an invalid language key if German descriptions are not wanted","Sprache 1:","DEU","durch ungültigen Sprachschlüssel ersetzen, wenn keine deutschen Texte übernommen werden sollen","Replace by an invalid language key if German descriptions are not wanted","Sprache 1:","DEU","durch ungültigen Sprachschlüssel ersetzen, wenn keine deutschen Texte übernommen werden sollen","Replace by an invalid language key if German descriptions are not wanted","Sprache 1:","DEU","durch ungültigen Sprachschlüssel ersetzen, wenn keine deutschen Texte übernommen werden sollen","Replace by an invalid language key if German descriptions are not wanted","Sprache 1:","DEU","durch ungültigen Sprachschlüssel ersetzen, wenn keine deutschen Texte übernommen werden sollen","Replace by an invalid language key if German descriptions are not wanted","Sprache 1:","DEU","durch ungültigen Sprachschlüssel ersetzen, wenn keine deutschen Texte übernommen werden sollen","Replace by an invalid language key if German descriptions are not wanted","Sprache 1:","DEU","durch ungültigen Sprachschlüssel ersetzen, wenn keine deutschen Texte übernommen werden sollen","Replace by an invalid language key if German descriptions are not wanted","Sprache 1:","DEU","durch ungültigen Sprachschlüssel ersetzen, wenn keine deutschen Texte übernommen werden sollen","Replace by an invalid language key if German descriptions are not wanted","Sprache 1:","DEU","durch ungültigen Sprachschlüssel ersetzen, wenn keine deutschen Texte übernommen werden sollen","Replace by an invalid language key if German descriptions are not wanted","Sprache 1:","DEU","durch ungültigen Sprachschlüssel ersetzen, wenn keine deutschen Texte übernommen werden sollen","Replace by an invalid language key if German descriptions are not wanted","Sprache 1:","DEU","durch ungültigen Sprachschlüssel ersetzen, wenn keine deutschen Texte übernommen werden sollen","Replace by an invalid language key if German descriptions are not wanted","Sprache 1:","DEU","durch ungültigen Sprachschlüssel ersetzen, wenn keine deutschen Texte übernommen werden sollen","Replace by an invalid language key if German descriptions are not wanted","Sprache 1:","DEU","durch ungültigen Sprachschlüssel ersetzen, wenn keine deutschen Texte übernommen werden sollen","Replace by an invalid language key if German descriptions are not wanted","Sprache 1:","DEU","durch ungültigen Sprachschlüssel ersetzen, wenn keine deutschen Texte übernommen werden sollen","Replace by an invalid language key if German descriptions are not wanted","Sprache 1:","DEU","durch ungültigen Sprachschlüssel ersetzen, wenn keine deutschen Texte übernommen werden sollen","Replace by an invalid language key if German descriptions are not wanted","Sprache 1:","DEU","durch ungültigen Sprachschlüssel ersetzen, wenn keine deutschen Texte übernommen werden sollen","Replace by an invalid language key if German descriptions are not wanted","Sprache 1:","DEU","durch ungültigen Sprachschlüssel ersetzen, wenn keine deutschen Texte übernommen werden sollen","Replace by an invalid language key if German descriptions are not wanted","Sprache 1:","DEU","durch ungültigen Sprachschlüssel ersetzen, wenn keine deutschen Texte übernommen werden sollen","Replace by an invalid language key if German descriptions are not wanted","Sprache 1:","DEU","durch ungültigen Sprachschlüssel ersetzen, wenn keine deutschen Texte übernommen werden sollen","Replace by an invalid language key if German descriptions are not wanted","Sprache 1:","DEU","durch ungültigen Sprachschlüssel ersetzen, wenn keine deutschen Texte übernommen werden sollen","Replace by an invalid language key if German descriptions are not wanted","Sprache 1:","DEU","durch ungültigen Sprachschlüssel ersetzen, wenn keine deutschen Texte übernommen werden sollen","Replace by an invalid language key if German descriptions are not wanted","Sprache 1:","DEU","durch ungültigen Sprachschlüssel ersetzen, wenn keine deutschen Texte übernommen werden sollen","Replace by an invalid language key if German descriptions are not wanted","Sprache 1:","DEU","durch ungültigen Sprachschlüssel ersetzen, wenn keine deutschen Texte übernommen werden sollen","Replace by an invalid language key if German descriptions are not wanted","Sprache 1:","DEU","durch ungültigen Sprachschlüssel ersetzen, wenn keine deutschen Texte übernommen werden sollen","Replace by an invalid language key if German descriptions are not wanted","Sprache 1:","DEU","durch ungültigen Sprachschlüssel ersetzen, wenn keine deutschen Texte übernommen werden sollen","Replace by an invalid language key if German descriptions are not wanted","Sprache 1:","DEU","durch ungültigen Sprachschlüssel ersetzen, wenn keine deutschen Texte übernommen werden sollen","Replace by an invalid language key if German descriptions are not wanted","Sprache 1:","DEU","durch ungültigen Sprachschlüssel ersetzen, wenn keine deutschen Texte übernommen werden sollen","Replace by an invalid language key if German descriptions are not wanted","Sprache 1:","DEU","durch ungültigen Sprachschlüssel ersetzen, wenn keine deutschen Texte übernommen werden sollen","Replace by an invalid language key if German descriptions are not wanted","Sprache 1:","DEU","durch ungültigen Sprachschlüssel ersetzen, wenn keine deutschen Texte übernommen werden sollen","Replace by an invalid language key if German descriptions are not wanted","Sprache 1:","DEU","durch ungültigen Sprachschlüssel ersetzen, wenn keine deutschen Texte übernommen werden sollen","Replace by an invalid language key if German descriptions are not wanted","Sprache 1:","DEU","durch ungültigen Sprachschlüssel ersetzen, wenn keine deutschen Texte übernommen werden sollen","Replace by an invalid language key if German descriptions are not wanted","Sprache 1:","DEU","durch ungültigen Sprachschlüssel ersetzen, wenn keine deutschen Texte übernommen werden sollen","Replace by an invalid language key if German descriptions are not wanted","Sprache 1:","DEU","durch ungültigen Sprachschlüssel ersetzen, wenn keine deutschen Texte übernommen werden sollen","Replace by an invalid language key if German descriptions are not wanted","Sprache 1:","DEU","durch ungültigen Sprachschlüssel ersetzen, wenn keine deutschen Texte übernommen werden sollen","Replace by an invalid language key if German descriptions are not wanted","Sprache 1:","DEU","durch ungültigen Sprachschlüssel ersetzen, wenn keine deutschen Texte übernommen werden sollen","Replace by an invalid language key if German descriptions are not wanted","Sprache 1:","DEU","durch ungültigen Sprachschlüssel ersetzen, wenn keine deutschen Texte übernommen werden sollen","Replace by an invalid language key if German descriptions are not wanted","Sprache 1:","DEU","durch ungültigen Sprachschlüssel ersetzen, wenn keine deutschen Texte übernommen werden sollen","Replace by an invalid language key if German descriptions are not wanted","Sprache 1:","DEU","durch ungültigen Sprachschlüssel ersetzen, wenn keine deutschen Texte übernommen werden sollen","Replace by an invalid language key if German descriptions are not wanted","Sprache 1:","DEU","durch ungültigen Sprachschlüssel ersetzen, wenn keine deutschen Texte übernommen werden sollen","Replace by an invalid language key if German descriptions are not wanted","Sprache 1:","DEU","durch ungültigen Sprachschlüssel ersetzen, wenn keine deutschen Texte übernommen werden sollen","Replace by an invalid language key if German descriptions are not wanted","Sprache 1:","DEU","durch ungültigen Sprachschlüssel ersetzen, wenn keine deutschen Texte übernommen werden sollen","Replace by an invalid language key if German descriptions are not wanted","Sprache 1:","DEU","durch ungültigen Sprachschlüssel ersetzen, wenn keine deutschen Texte übernommen werden sollen","Replace by an invalid language key if German descriptions are not wanted","Sprache 1:","DEU","durch ungültigen Sprachschlüssel ersetzen, wenn keine deutschen Texte übernommen werden sollen","Replace by an invalid language key if German descriptions are not wanted","Sprache 1:","DEU","durch ungültigen Sprachschlüssel ersetzen, wenn keine deutschen Texte übernommen werden sollen","Replace by an invalid language key if German descriptions are not wanted","Sprache 1:","DEU","durch ungültigen Sprachschlüssel ersetzen, wenn keine deutschen Texte übernommen werden sollen","Replace by an invalid language key if German descriptions are not wanted","Sprache 1:","DEU","durch ungültigen Sprachschlüssel ersetzen, wenn keine deutschen Texte übernommen werden sollen","Replace by an invalid language key if German descriptions are not wanted","Sprache 1:","DEU","durch ungültigen Sprachschlüssel ersetzen, wenn keine deutschen Texte übernommen werden sollen","Replace by an invalid language key if German descriptions are not wanted","Sprache 1:","DEU","durch ungültigen Sprachschlüssel ersetzen, wenn keine deutschen Texte übernommen werden sollen","Replace by an invalid language key if German descriptions are not wanted","Sprache 1:","DEU","durch ungültigen Sprachschlüssel ersetzen, wenn keine deutschen Texte übernommen werden sollen","Replace by an invalid language key if German descriptions are not wanted","Sprache 1:","DEU","durch ungültigen Sprachschlüssel ersetzen, wenn keine deutschen Texte übernommen werden sollen","Replace by an invalid language key if German descriptions are not wanted","Sprache 1:","DEU","durch ungültigen Sprachschlüssel ersetzen, wenn keine deutschen Texte übernommen werden sollen","Replace by an invalid language key if German descriptions are not wanted","Sprache 1:","DEU","durch ungültigen Sprachschlüssel ersetzen, wenn keine deutschen Texte übernommen werden sollen","Replace by an invalid language key if German descriptions are not wanted","Sprache 1:","DEU","durch ungültigen Sprachschlüssel ersetzen, wenn keine deutschen Texte übernommen werden sollen","Replace by an invalid language key if German descriptions are not wanted","Sprache 1:","DEU","durch ungültigen Sprachschlüssel ersetzen, wenn keine deutschen Texte übernommen werden sollen","Replace by an invalid language key if German descriptions are not wanted","Sprache 1:","DEU","durch ungültigen Sprachschlüssel ersetzen, wenn keine deutschen Texte übernommen werden sollen","Replace by an invalid language key if German descriptions are not wanted","Sprache 1:","DEU","durch ungültigen Sprachschlüssel ersetzen, wenn keine deutschen Texte übernommen werden sollen","Replace by an invalid language key if German descriptions are not wanted","Sprache 1:","DEU","durch ungültigen Sprachschlüssel ersetzen, wenn keine deutschen Texte übernommen werden sollen","Replace by an invalid language key if German descriptions are not wanted","Sprache 1:","DEU","durch ungültigen Sprachschlüssel ersetzen, wenn keine deutschen Texte übernommen werden sollen","Replace by an invalid language key if German descriptions are not wanted","Sprache 1:","DEU","durch ungültigen Sprachschlüssel ersetzen, wenn keine deutschen Texte übernommen werden sollen","Replace by an invalid language key if German descriptions are not wanted","Sprache 1:","DEU","durch ungültigen Sprachschlüssel ersetzen, wenn keine deutschen Texte übernommen werden sollen","Replace by an invalid language key if German descriptions are not wanted","Sprache 1:","DEU","durch ungültigen Sprachschlüssel ersetzen, wenn keine deutschen Texte übernommen werden sollen","Replace by an invalid language key if German descriptions are not wanted","Sprache 1:","DEU","durch ungültigen Sprachschlüssel ersetzen, wenn keine deutschen Texte übernommen werden sollen","Replace by an invalid language key if German descriptions are not wanted","Sprache 1:","DEU","durch ungültigen Sprachschlüssel ersetzen, wenn keine deutschen Texte übernommen werden sollen","Replace by an invalid language key if German descriptions are not wanted","Sprache 1:","DEU","durch ungültigen Sprachschlüssel ersetzen, wenn keine deutschen Texte übernommen werden sollen","Replace by an invalid language key if German descriptions are not wanted","Sprache 1:","DEU","durch ungültigen Sprachschlüssel ersetzen, wenn keine deutschen Texte übernommen werden sollen","Replace by an invalid language key if German descriptions are not wanted","Sprache 1:","DEU","durch ungültigen Sprachschlüssel ersetzen, wenn keine deutschen Texte übernommen werden sollen","Replace by an invalid language key if German descriptions are not wanted","Sprache 1:","DEU","durch ungültigen Sprachschlüssel ersetzen, wenn keine deutschen Texte übernommen werden sollen","Replace by an invalid language key if German descriptions are not wanted","Sprache 1:","DEU","durch ungültigen Sprachschlüssel ersetzen, wenn keine deutschen Texte übernommen werden sollen","Replace by an invalid language key if German descriptions are not wanted","Sprache 1:","DEU","durch ungültigen Sprachschlüssel ersetzen, wenn keine deutschen Texte übernommen werden sollen","Replace by an invalid language key if German descriptions are not wanted","Sprache 1:","DEU","durch ungültigen Sprachschlüssel ersetzen, wenn keine deutschen Texte übernommen werden sollen","Replace by an invalid language key if German descriptions are not wanted","Sprache 1:","DEU","durch ungültigen Sprachschlüssel ersetzen, wenn keine deutschen Texte übernommen werden sollen","Replace by an invalid language key if German descriptions are not wanted","Sprache 1:","DEU","durch ungültigen Sprachschlüssel ersetzen, wenn keine deutschen Texte übernommen werden sollen","Replace by an invalid language key if German descriptions are not wanted","Sprache 1:","DEU","durch ungültigen Sprachschlüssel ersetzen, wenn keine deutschen Texte übernommen werden sollen","Replace by an invalid language key if German descriptions are not wanted","Sprache 1:","DEU","durch ungültigen Sprachschlüssel ersetzen, wenn keine deutschen Texte übernommen werden sollen","Replace by an invalid language key if German descriptions are not wanted","Sprache 1:","DEU","durch ungültigen Sprachschlüssel ersetzen, wenn keine deutschen Texte übernommen werden sollen","Replace by an invalid language key if German descriptions are not wanted","Sprache 1:","DEU","durch ungültigen Sprachschlüssel ersetzen, wenn keine deutschen Texte übernommen werden sollen","Replace by an invalid language key if German descriptions are not wanted","Sprache 1:","DEU","durch ungültigen Sprachschlüssel ersetzen, wenn keine deutschen Texte übernommen werden sollen","Replace by an invalid language key if German descriptions are not wanted","Sprache 1:","DEU","durch ungültigen Sprachschlüssel ersetzen, wenn keine deutschen Texte übernommen werden sollen","Replace by an invalid language key if German descriptions are not wanted","Sprache 1:","DEU","durch ungültigen Sprachschlüssel ersetzen, wenn keine deutschen Texte übernommen werden sollen","Replace by an invalid language key if German descriptions are not wanted","Sprache 1:","DEU","durch ungültigen Sprachschlüssel ersetzen, wenn keine deutschen Texte übernommen werden sollen","Replace by an invalid language key if German descriptions are not wanted","Sprache 1:","DEU","durch ungültigen Sprachschlüssel ersetzen, wenn keine deutschen Texte übernommen werden sollen","Replace by an invalid language key if German descriptions are not wanted","Sprache 1:","DEU","durch ungültigen Sprachschlüssel ersetzen, wenn keine deutschen Texte übernommen werden sollen","Replace by an invalid language key if German descriptions are not wanted","Sprache 1:","DEU","durch ungültigen Sprachschlüssel ersetzen, wenn keine deutschen Texte übernommen werden sollen","Replace by an invalid language key if German descriptions are not wanted","Sprache 1:","DEU","durch ungültigen Sprachschlüssel ersetzen, wenn keine deutschen Texte übernommen werden sollen","Replace by an invalid language key if German descriptions are not wanted","Sprache 1:","DEU","durch ungültigen Sprachschlüssel ersetzen, wenn keine deutschen Texte übernommen werden sollen","Replace by an invalid language key if German descriptions are not wanted","Sprache 1:","DEU","durch ungültigen Sprachschlüssel ersetzen, wenn keine deutschen Texte übernommen werden sollen","Replace by an invalid language key if German descriptions are not wanted","Sprache 1:","DEU","durch ungültigen Sprachschlüssel ersetzen, wenn keine deutschen Texte übernommen werden sollen","Replace by an invalid language key if German descriptions are not wanted","Sprache 1:","DEU","durch ungültigen Sprachschlüssel ersetzen, wenn keine deutschen Texte übernommen werden sollen","Replace by an invalid language key if German descriptions are not wanted","Sprache 1:","DEU","durch ungültigen Sprachschlüssel ersetzen, wenn keine deutschen Texte übernommen werden sollen","Replace by an invalid language key if German descriptions are not wanted","Sprache 1:","DEU","durch ungültigen Sprachschlüssel ersetzen, wenn keine deutschen Texte übernommen werden sollen","Replace by an invalid language key if German descriptions are not wanted","Sprache 1:","DEU","durch ungültigen Sprachschlüssel ersetzen, wenn keine deutschen Texte übernommen werden sollen","Replace by an invalid language key if German descriptions are not wanted","Sprache 1:","DEU","durch ungültigen Sprachschlüssel ersetzen, wenn keine deutschen Texte übernommen werden sollen","Replace by an invalid language key if German descriptions are not wanted","Sprache 1:","DEU","durch ungültigen Sprachschlüssel ersetzen, wenn keine deutschen Texte übernommen werden sollen","Replace by an invalid language key if German descriptions are not wanted","Sprache 1:","DEU","durch ungültigen Sprachschlüssel ersetzen, wenn keine deutschen Texte übernommen werden sollen","Replace by an invalid language key if German descriptions are not wanted","Sprache 1:","DEU","durch ungültigen Sprachschlüssel ersetzen, wenn keine deutschen Texte übernommen werden sollen","Replace by an invalid language key if German descriptions are not wanted","Sprache 1:","DEU","durch ungültigen Sprachschlüssel ersetzen, wenn keine deutschen Texte übernommen werden sollen","Replace by an invalid language key if German descriptions are not wanted","Sprache 1:","DEU","durch ungültigen Sprachschlüssel ersetzen, wenn keine deutschen Texte übernommen werden sollen","Replace by an invalid language key if German descriptions are not wanted","Sprache 1:","DEU","durch ungültigen Sprachschlüssel ersetzen, wenn keine deutschen Texte übernommen werden sollen","Replace by an invalid language key if German descriptions are not wanted","Sprache 1:","DEU","durch ungültigen Sprachschlüssel ersetzen, wenn keine deutschen Texte übernommen werden sollen","Replace by an invalid language key if German descriptions are not wanted","Sprache 1:","DEU","durch ungültigen Sprachschlüssel ersetzen, wenn keine deutschen Texte übernommen werden sollen","Replace by an invalid language key if German descriptions are not wanted","Sprache 1:","DEU","durch ungültigen Sprachschlüssel ersetzen, wenn keine deutschen Texte übernommen werden sollen","Replace by an invalid language key if German descriptions are not wanted","Sprache 1:","DEU","durch ungültigen Sprachschlüssel ersetzen, wenn keine deutschen Texte übernommen werden sollen","Replace by an invalid language key if German descriptions are not wanted","Sprache 1:","DEU","durch ungültigen Sprachschlüssel ersetzen, wenn keine deutschen Texte übernommen werden sollen","Replace by an invalid language key if German descriptions are not wanted","Sprache 1:","DEU","durch ungültigen Sprachschlüssel ersetzen, wenn keine deutschen Texte übernommen werden sollen","Replace by an invalid language key if German descriptions are not wanted","Sprache 1:","DEU","durch ungültigen Sprachschlüssel ersetzen, wenn keine deutschen Texte übernommen werden sollen","Replace by an invalid language key if German descriptions are not wanted","Sprache 1:","DEU","durch ungültigen Sprachschlüssel ersetzen, wenn keine deutschen Texte übernommen werden sollen","Replace by an invalid language key if German descriptions are not wanted","Sprache 1:","DEU","durch ungültigen Sprachschlüssel ersetzen, wenn keine deutschen Texte übernommen werden sollen","Replace by an invalid language key if German descriptions are not wanted","Sprache 1:","DEU","durch ungültigen Sprachschlüssel ersetzen, wenn keine deutschen Texte übernommen werden sollen","Replace by an invalid language key if German descriptions are not wanted","Sprache 1:","DEU","durch ungültigen Sprachschlüssel ersetzen, wenn keine deutschen Texte übernommen werden sollen","Replace by an invalid language key if German descriptions are not wanted","Sprache 1:","DEU","durch ungültigen Sprachschlüssel ersetzen, wenn keine deutschen Texte übernommen werden sollen","Replace by an invalid language key if German descriptions are not wanted","Sprache 1:","DEU","durch ungültigen Sprachschlüssel ersetzen, wenn keine deutschen Texte übernommen werden sollen","Replace by an invalid language key if German descriptions are not wanted","Sprache 1:","DEU","durch ungültigen Sprachschlüssel ersetzen, wenn keine deutschen Texte übernommen werden sollen","Replace by an invalid language key if German descriptions are not wanted","Sprache 1:","DEU","durch ungültigen Sprachschlüssel ersetzen, wenn keine deutschen Texte übernommen werden sollen","Replace by an invalid language key if German descriptions are not wanted","Sprache 1:","DEU","durch ungültigen Sprachschlüssel ersetzen, wenn keine deutschen Texte übernommen werden sollen","Replace by an invalid language key if German descriptions are not wanted","Sprache 1:","DEU","durch ungültigen Sprachschlüssel ersetzen, wenn keine deutschen Texte übernommen werden sollen","Replace by an invalid language key if German descriptions are not wanted","Sprache 1:","DEU","durch ungültigen Sprachschlüssel ersetzen, wenn keine deutschen Texte übernommen werden sollen","Replace by an invalid language key if German descriptions are not wanted","Sprache 1:","DEU","durch ungültigen Sprachschlüssel ersetzen, wenn keine deutschen Texte übernommen werden sollen","Replace by an invalid language key if German descriptions are not wanted","Sprache 1:","DEU","durch ungültigen Sprachschlüssel ersetzen, wenn keine deutschen Texte übernommen werden sollen","Replace by an invalid language key if German descriptions are not wanted","Sprache 1:","DEU","durch ungültigen Sprachschlüssel ersetzen, wenn keine deutschen Texte übernommen werden sollen","Replace by an invalid language key if German descriptions are not wanted","Sprache 1:","DEU","durch ungültigen Sprachschlüssel ersetzen, wenn keine deutschen Texte übernommen werden sollen","Replace by an invalid language key if German descriptions are not wanted","Sprache 1:","DEU","durch ungültigen Sprachschlüssel ersetzen, wenn keine deutschen Texte übernommen werden sollen","Replace by an invalid language key if German descriptions are not wanted","Sprache 1:","DEU","durch ungültigen Sprachschlüssel ersetzen, wenn keine deutschen Texte übernommen werden sollen","Replace by an invalid language key if German descriptions are not wanted","Sprache 1:","DEU","durch ungültigen Sprachschlüssel ersetzen, wenn keine deutschen Texte übernommen werden sollen","Replace by an invalid language key if German descriptions are not wanted","Sprache 1:","DEU","durch ungültigen Sprachschlüssel ersetzen, wenn keine deutschen Texte übernommen werden sollen","Replace by an invalid language key if German descriptions are not wanted","Sprache 1:","DEU","durch ungültigen Sprachschlüssel ersetzen, wenn keine deutschen Texte übernommen werden sollen","Replace by an invalid language key if German descriptions are not wanted","Sprache 1:","DEU","durch ungültigen Sprachschlüssel ersetzen, wenn keine deutschen Texte übernommen werden sollen","Replace by an invalid language key if German descriptions are not wanted","Sprache 1:","DEU","durch ungültigen Sprachschlüssel ersetzen, wenn keine deutschen Texte übernommen werden sollen","Replace by an invalid language key if German descriptions are not wanted","Sprache 1:","DEU","durch ungültigen Sprachschlüssel ersetzen, wenn keine deutschen Texte übernommen werden sollen","Replace by an invalid language key if German descriptions are not wanted","Sprache 1:","DEU","durch ungültigen Sprachschlüssel ersetzen, wenn keine deutschen Texte übernommen werden sollen","Replace by an invalid language key if German descriptions are not wanted","Sprache 1:","DEU","durch ungültigen Sprachschlüssel ersetzen, wenn keine deutschen Texte übernommen werden sollen","Replace by an invalid language key if German descriptions are not wanted","Sprache 1:","DEU","durch ungültigen Sprachschlüssel ersetzen, wenn keine deutschen Texte übernommen werden sollen","Replace by an invalid language key if German descriptions are not wanted","Sprache 1:","DEU","durch ungültigen Sprachschlüssel ersetzen, wenn keine deutschen Texte übernommen werden sollen","Replace by an invalid language key if German descriptions are not wanted","Sprache 1:","DEU","durch ungültigen Sprachschlüssel ersetzen, wenn keine deutschen Texte übernommen werden sollen","Replace by an invalid language key if German descriptions are not wanted","Sprache 1:","DEU","durch ungültigen Sprachschlüssel ersetzen, wenn keine deutschen Texte übernommen werden sollen","Replace by an invalid language key if German descriptions are not wanted","Sprache 1:","DEU","durch ungültigen Sprachschlüssel ersetzen, wenn keine deutschen Texte übernommen werden sollen","Replace by an invalid language key if German descriptions are not wanted","Sprache 1:","DEU","durch ungültigen Sprachschlüssel ersetzen, wenn keine deutschen Texte übernommen werden sollen","Replace by an invalid language key if German descriptions are not wanted","Sprache 1:","DEU","durch ungültigen Sprachschlüssel ersetzen, wenn keine deutschen Texte übernommen werden sollen","Replace by an invalid language key if German descriptions are not wanted","Sprache 1:","DEU","durch ungültigen Sprachschlüssel ersetzen, wenn keine deutschen Texte übernommen werden sollen","Replace by an invalid language key if German descriptions are not wanted","Sprache 1:","DEU","durch ungültigen Sprachschlüssel ersetzen, wenn keine deutschen Texte übernommen werden sollen","Replace by an invalid language key if German descriptions are not wanted","Sprache 1:","DEU","durch ungültigen Sprachschlüssel ersetzen, wenn keine deutschen Texte übernommen werden sollen","Replace by an invalid language key if German descriptions are not wanted","Sprache 1:","DEU","durch ungültigen Sprachschlüssel ersetzen, wenn keine deutschen Texte übernommen werden sollen","Replace by an invalid language key if German descriptions are not wanted","Sprache 1:","DEU","durch ungültigen Sprachschlüssel ersetzen, wenn keine deutschen Texte übernommen werden sollen","Replace by an invalid language key if German descriptions are not wanted","Sprache 1:","DEU","durch ungültigen Sprachschlüssel ersetzen, wenn keine deutschen Texte übernommen werden sollen","Replace by an invalid language key if German descriptions are not wanted","Sprache 1:","DEU","durch ungültigen Sprachschlüssel ersetzen, wenn keine deutschen Texte übernommen werden sollen","Replace by an invalid language key if German descriptions are not wanted","Sprache 1:","DEU","durch ungültigen Sprachschlüssel ersetzen, wenn keine deutschen Texte übernommen werden sollen","Replace by an invalid language key if German descriptions are not wanted","Sprache 1:","DEU","durch ungültigen Sprachschlüssel ersetzen, wenn keine deutschen Texte übernommen werden sollen","Replace by an invalid language key if German descriptions are not wanted","Sprache 1:","DEU","durch ungültigen Sprachschlüssel ersetzen, wenn keine deutschen Texte übernommen werden sollen","Replace by an invalid language key if German descriptions are not wanted","Sprache 1:","DEU","durch ungültigen Sprachschlüssel ersetzen, wenn keine deutschen Texte übernommen werden sollen","Replace by an invalid language key if German descriptions are not wanted","Sprache 1:","DEU","durch ungültigen Sprachschlüssel ersetzen, wenn keine deutschen Texte übernommen werden sollen","Replace by an invalid language key if German descriptions are not wanted","Sprache 1:","DEU","durch ungültigen Sprachschlüssel ersetzen, wenn keine deutschen Texte übernommen werden sollen","Replace by an invalid language key if German descriptions are not wanted","Sprache 1:","DEU","durch ungültigen Sprachschlüssel ersetzen, wenn keine deutschen Texte übernommen werden sollen","Replace by an invalid language key if German descriptions are not wanted","Sprache 1:","DEU","durch ungültigen Sprachschlüssel ersetzen, wenn keine deutschen Texte übernommen werden sollen","Replace by an invalid language key if German descriptions are not wanted","Sprache 1:","DEU","durch ungültigen Sprachschlüssel ersetzen, wenn keine deutschen Texte übernommen werden sollen","Replace by an invalid language key if German descriptions are not wanted","Sprache 1:","DEU","durch ungültigen Sprachschlüssel ersetzen, wenn keine deutschen Texte übernommen werden sollen","Replace by an invalid language key if German descriptions are not wanted","Sprache 1:","DEU","durch ungültigen Sprachschlüssel ersetzen, wenn keine deutschen Texte übernommen werden sollen","Replace by an invalid language key if German descriptions are not wanted","Sprache 1:","DEU","durch ungültigen Sprachschlüssel ersetzen, wenn keine deutschen Texte übernommen werden sollen","Replace by an invalid language key if German descriptions are not wanted","Sprache 1:","DEU","durch ungültigen Sprachschlüssel ersetzen, wenn keine deutschen Texte übernommen werden sollen","Replace by an invalid language key if German descriptions are not wanted","Sprache 1:","DEU","durch ungültigen Sprachschlüssel ersetzen, wenn keine deutschen Texte übernommen werden sollen","Replace by an invalid language key if German descriptions are not wanted","Sprache 1:","DEU","durch ungültigen Sprachschlüssel ersetzen, wenn keine deutschen Texte übernommen werden sollen","Replace by an invalid language key if German descriptions are not wanted","Sprache 1:","DEU","durch ungültigen Sprachschlüssel ersetzen, wenn keine deutschen Texte übernommen werden sollen","Replace by an invalid language key if German descriptions are not wanted","Sprache 1:","DEU","durch ungültigen Sprachschlüssel ersetzen, wenn keine deutschen Texte übernommen werden sollen","Replace by an invalid language key if German descriptions are not wanted","Sprache 1:","DEU","durch ungültigen Sprachschlüssel ersetzen, wenn keine deutschen Texte übernommen werden sollen","Replace by an invalid language key if German descriptions are not wanted","Sprache 1:","DEU","durch ungültigen Sprachschlüssel ersetzen, wenn keine deutschen Texte übernommen werden sollen","Replace by an invalid language key if German descriptions are not wanted","Sprache 1:","DEU","durch ungültigen Sprachschlüssel ersetzen, wenn keine deutschen Texte übernommen werden sollen","Replace by an invalid language key if German descriptions are not wanted","Sprache 1:","DEU","durch ungültigen Sprachschlüssel ersetzen, wenn keine deutschen Texte übernommen werden sollen","Replace by an invalid language key if German descriptions are not wanted","Sprache 1:","DEU","durch ungültigen Sprachschlüssel ersetzen, wenn keine deutschen Texte übernommen werden sollen","Replace by an invalid language key if German descriptions are not wanted","Sprache 1:","DEU","durch ungültigen Sprachschlüssel ersetzen, wenn keine deutschen Texte übernommen werden sollen","Replace by an invalid language key if German descriptions are not wanted","Sprache 1:","DEU","durch ungültigen Sprachschlüssel ersetzen, wenn keine deutschen Texte übernommen werden sollen","Replace by an invalid language key if German descriptions are not wanted","Sprache 1:","DEU","durch ungültigen Sprachschlüssel ersetzen, wenn keine deutschen Texte übernommen werden sollen","Replace by an invalid language key if German descriptions are not wanted","Sprache 1:","DEU","durch ungültigen Sprachschlüssel ersetzen, wenn keine deutschen Texte übernommen werden sollen","Replace by an invalid language key if German descriptions are not wanted","Sprache 1:","DEU","durch ungültigen Sprachschlüssel ersetzen, wenn keine deutschen Texte übernommen werden sollen","Replace by an invalid language key if German descriptions are not wanted","Sprache 1:","DEU","durch ungültigen Sprachschlüssel ersetzen, wenn keine deutschen Texte übernommen werden sollen","Replace by an invalid language key if German descriptions are not wanted","Sprache 1:","DEU","durch ungültigen Sprachschlüssel ersetzen, wenn keine deutschen Texte übernommen werden sollen","Replace by an invalid language key if German descriptions are not wanted","Sprache 1:","DEU","durch ungültigen Sprachschlüssel ersetzen, wenn keine deutschen Texte übernommen werden sollen","Replace by an invalid language key if German descriptions are not wanted","Sprache 1:","DEU","durch ungültigen Sprachschlüssel ersetzen, wenn keine deutschen Texte übernommen werden sollen","Replace by an invalid language key if German descriptions are not wanted","Sprache 1:","DEU","durch ungültigen Sprachschlüssel ersetzen, wenn keine deutschen Texte übernommen werden sollen","Replace by an invalid language key if German descriptions are not wanted","Sprache 1:","DEU","durch ungültigen Sprachschlüssel ersetzen, wenn keine deutschen Texte übernommen werden sollen","Replace by an invalid language key if German descriptions are not wanted","Sprache 1:","DEU","durch ungültigen Sprachschlüssel ersetzen, wenn keine deutschen Texte übernommen werden sollen","Replace by an invalid language key if German descriptions are not wanted","Sprache 1:","DEU","durch ungültigen Sprachschlüssel ersetzen, wenn keine deutschen Texte übernommen werden sollen","Replace by an invalid language key if German descriptions are not wanted","Sprache 1:","DEU","durch ungültigen Sprachschlüssel ersetzen, wenn keine deutschen Texte übernommen werden sollen","Replace by an invalid language key if German descriptions are not wanted","Sprache 1:","DEU","durch ungültigen Sprachschlüssel ersetzen, wenn keine deutschen Texte übernommen werden sollen","Replace by an invalid language key if German descriptions are not wanted","Sprache 1:","DEU","durch ungültigen Sprachschlüssel ersetzen, wenn keine deutschen Texte übernommen werden sollen","Replace by an invalid language key if German descriptions are not wanted","Sprache 1:","DEU","durch ungültigen Sprachschlüssel ersetzen, wenn keine deutschen Texte übernommen werden sollen","Replace by an invalid language key if German descriptions are not wanted","Sprache 1:","DEU","durch ungültigen Sprachschlüssel ersetzen, wenn keine deutschen Texte übernommen werden sollen","Replace by an invalid language key if German descriptions are not wanted","Sprache 1:","DEU","durch ungültigen Sprachschlüssel ersetzen, wenn keine deutschen Texte übernommen werden sollen","Replace by an invalid language key if German descriptions are not wanted","Sprache 1:","DEU","durch ungültigen Sprachschlüssel ersetzen, wenn keine deutschen Texte übernommen werden sollen","Replace by an invalid language key if German descriptions are not wanted","Sprache 1:","DEU","durch ungültigen Sprachschlüssel ersetzen, wenn keine deutschen Texte übernommen werden sollen","Replace by an invalid language key if German descriptions are not wanted","Sprache 1:","DEU","durch ungültigen Sprachschlüssel ersetzen, wenn keine deutschen Texte übernommen werden sollen","Replace by an invalid language key if German descriptions are not wanted","Sprache 1:","DEU","durch ungültigen Sprachschlüssel ersetzen, wenn keine deutschen Texte übernommen werden sollen","Replace by an invalid language key if German descriptions are not wanted","Sprache 1:","DEU","durch ungültigen Sprachschlüssel ersetzen, wenn keine deutschen Texte übernommen werden sollen","Replace by an invalid language key if German descriptions are not wanted","Sprache 1:","DEU","durch ungültigen Sprachschlüssel ersetzen, wenn keine deutschen Texte übernommen werden sollen","Replace by an invalid language key if German descriptions are not wanted","Sprache 1:","DEU","durch ungültigen Sprachschlüssel ersetzen, wenn keine deutschen Texte übernommen werden sollen","Replace by an invalid language key if German descriptions are not wanted","Sprache 1:","DEU","durch ungültigen Sprachschlüssel ersetzen, wenn keine deutschen Texte übernommen werden sollen","Replace by an invalid language key if German descriptions are not wanted","Sprache 1:","DEU","durch ungültigen Sprachschlüssel ersetzen, wenn keine deutschen Texte übernommen werden sollen","Replace by an invalid language key if German descriptions are not wanted","Sprache 1:","DEU","durch ungültigen Sprachschlüssel ersetzen, wenn keine deutschen Texte übernommen werden sollen","Replace by an invalid language key if German descriptions are not wanted","Sprache 1:","DEU","durch ungültigen Sprachschlüssel ersetzen, wenn keine deutschen Texte übernommen werden sollen","Replace by an invalid language key if German descriptions are not wanted","Sprache 1:","DEU","durch ungültigen Sprachschlüssel ersetzen, wenn keine deutschen Texte übernommen werden sollen","Replace by an invalid language key if German descriptions are not wanted","Sprache 1:","DEU","durch ungültigen Sprachschlüssel ersetzen, wenn keine deutschen Texte übernommen werden sollen","Replace by an invalid language key if German descriptions are not wanted","Sprache 1:","DEU","durch ungültigen Sprachschlüssel ersetzen, wenn keine deutschen Texte übernommen werden sollen","Replace by an invalid language key if German descriptions are not wanted","Sprache 1:","DEU","durch ungültigen Sprachschlüssel ersetzen, wenn keine deutschen Texte übernommen werden sollen","Replace by an invalid language key if German descriptions are not wanted","Sprache 1:","DEU","durch ungültigen Sprachschlüssel ersetzen, wenn keine deutschen Texte übernommen werden sollen","Replace by an invalid language key if German descriptions are not wanted","Sprache 1:","DEU","durch ungültigen Sprachschlüssel ersetzen, wenn keine deutschen Texte übernommen werden sollen","Replace by an invalid language key if German descriptions are not wanted","Sprache 1:","DEU","durch ungültigen Sprachschlüssel ersetzen, wenn keine deutschen Texte übernommen werden sollen","Replace by an invalid language key if German descriptions are not wanted","Sprache 1:","DEU","durch ungültigen Sprachschlüssel ersetzen, wenn keine deutschen Texte übernommen werden sollen","Replace by an invalid language key if German descriptions are not wanted","Sprache 1:","DEU","durch ungültigen Sprachschlüssel ersetzen, wenn keine deutschen Texte übernommen werden sollen","Replace by an invalid language key if German descriptions are not wanted","Sprache 1:","DEU","durch ungültigen Sprachschlüssel ersetzen, wenn keine deutschen Texte übernommen werden sollen","Replace by an invalid language key if German descriptions are not wanted","Sprache 1:","DEU","durch ungültigen Sprachschlüssel ersetzen, wenn keine deutschen Texte übernommen werden sollen","Replace by an invalid language key if German descriptions are not wanted","Sprache 1:","DEU","durch ungültigen Sprachschlüssel ersetzen, wenn keine deutschen Texte übernommen werden sollen","Replace by an invalid language key if German descriptions are not wanted","Sprache 1:","DEU","durch ungültigen Sprachschlüssel ersetzen, wenn keine deutschen Texte übernommen werden sollen","Replace by an invalid language key if German descriptions are not wanted","Sprache 1:","DEU","durch ungültigen Sprachschlüssel ersetzen, wenn keine deutschen Texte übernommen werden sollen","Replace by an invalid language key if German descriptions are not wanted","Sprache 1:","DEU","durch ungültigen Sprachschlüssel ersetzen, wenn keine deutschen Texte übernommen werden sollen","Replace by an invalid language key if German descriptions are not wanted","Sprache 1:","DEU","durch ungültigen Sprachschlüssel ersetzen, wenn keine deutschen Texte übernommen werden sollen","Replace by an invalid language key if German descriptions are not wanted","Sprache 1:","DEU","durch ungültigen Sprachschlüssel ersetzen, wenn keine deutschen Texte übernommen werden sollen","Replace by an invalid language key if German descriptions are not wanted","Sprache 1:","DEU","durch ungültigen Sprachschlüssel ersetzen, wenn keine deutschen Texte übernommen werden sollen","Replace by an invalid language key if German descriptions are not wanted","Sprache 1:","DEU","durch ungültigen Sprachschlüssel ersetzen, wenn keine deutschen Texte übernommen werden sollen","Replace by an invalid language key if German descriptions are not wanted","Sprache 1:","DEU","durch ungültigen Sprachschlüssel ersetzen, wenn keine deutschen Texte übernommen werden sollen","Replace by an invalid language key if German descriptions are not wanted","Sprache 1:","DEU","durch ungültigen Sprachschlüssel ersetzen, wenn keine deutschen Texte übernommen werden sollen","Replace by an invalid language key if German descriptions are not wanted","Sprache 1:","DEU","durch ungültigen Sprachschlüssel ersetzen, wenn keine deutschen Texte übernommen werden sollen","Replace by an invalid language key if German descriptions are not wanted","Sprache 1:","DEU","durch ungültigen Sprachschlüssel ersetzen, wenn keine deutschen Texte übernommen werden sollen","Replace by an invalid language key if German descriptions are not wanted","Sprache 1:","DEU","durch ungültigen Sprachschlüssel ersetzen, wenn keine deutschen Texte übernommen werden sollen","Replace by an invalid language key if German descriptions are not wanted","Sprache 1:","DEU","durch ungültigen Sprachschlüssel ersetzen, wenn keine deutschen Texte übernommen werden sollen","Replace by an invalid language key if German descriptions are not wanted","Sprache 1:","DEU","durch ungültigen Sprachschlüssel ersetzen, wenn keine deutschen Texte übernommen werden sollen","Replace by an invalid language key if German descriptions are not wanted","Sprache 1:","DEU","durch ungültigen Sprachschlüssel ersetzen, wenn keine deutschen Texte übernommen werden sollen","Replace by an invalid language key if German descriptions are not wanted","Sprache 1:","DEU","durch ungültigen Sprachschlüssel ersetzen, wenn keine deutschen Texte übernommen werden sollen","Replace by an invalid language key if German descriptions are not wanted","Sprache 1:","DEU","durch ungültigen Sprachschlüssel ersetzen, wenn keine deutschen Texte übernommen werden sollen","Replace by an invalid language key if German descriptions are not wanted","Sprache 1:","DEU","durch ungültigen Sprachschlüssel ersetzen, wenn keine deutschen Texte übernommen werden sollen","Replace by an invalid language key if German descriptions are not wanted","Sprache 1:","DEU","durch ungültigen Sprachschlüssel ersetzen, wenn keine deutschen Texte übernommen werden sollen","Replace by an invalid language key if German descriptions are not wanted","Sprache 1:","DEU","durch ungültigen Sprachschlüssel ersetzen, wenn keine deutschen Texte übernommen werden sollen","Replace by an invalid language key if German descriptions are not wanted","Sprache 1:","DEU","durch ungültigen Sprachschlüssel ersetzen, wenn keine deutschen Texte übernommen werden sollen","Replace by an invalid language key if German descriptions are not wanted","Sprache 1:","DEU","durch ungültigen Sprachschlüssel ersetzen, wenn keine deutschen Texte übernommen werden sollen","Replace by an invalid language key if German descriptions are not wanted","Sprache 1:","DEU","durch ungültigen Sprachschlüssel ersetzen, wenn keine deutschen Texte übernommen werden sollen","Replace by an invalid language key if German descriptions are not wanted","Sprache 1:","DEU","durch ungültigen Sprachschlüssel ersetzen, wenn keine deutschen Texte übernommen werden sollen","Replace by an invalid language key if German descriptions are not wanted","Sprache 1:","DEU","durch ungültigen Sprachschlüssel ersetzen, wenn keine deutschen Texte übernommen werden sollen","Replace by an invalid language key if German descriptions are not wanted","Sprache 1:","DEU","durch ungültigen Sprachschlüssel ersetzen, wenn keine deutschen Texte übernommen werden sollen","Replace by an invalid language key if German descriptions are not wanted","Sprache 1:","DEU","durch ungültigen Sprachschlüssel ersetzen, wenn keine deutschen Texte übernommen werden sollen","Replace by an invalid language key if German descriptions are not wanted","Sprache 1:","DEU","durch ungültigen Sprachschlüssel ersetzen, wenn keine deutschen Texte übernommen werden sollen","Replace by an invalid language key if German descriptions are not wanted","Sprache 1:","DEU","durch ungültigen Sprachschlüssel ersetzen, wenn keine deutschen Texte übernommen werden sollen","Replace by an invalid language key if German descriptions are not wanted","Sprache 1:","DEU","durch ungültigen Sprachschlüssel ersetzen, wenn keine deutschen Texte übernommen werden sollen","Replace by an invalid language key if German descriptions are not wanted","Sprache 1:","DEU","durch ungültigen Sprachschlüssel ersetzen, wenn keine deutschen Texte übernommen werden sollen","Replace by an invalid language key if German descriptions are not wanted","Sprache 1:","DEU","durch ungültigen Sprachschlüssel ersetzen, wenn keine deutschen Texte übernommen werden sollen","Replace by an invalid language key if German descriptions are not wanted","Sprache 1:","DEU","durch ungültigen Sprachschlüssel ersetzen, wenn keine deutschen Texte übernommen werden sollen","Replace by an invalid language key if German descriptions are not wanted","Sprache 1:","DEU","durch ungültigen Sprachschlüssel ersetzen, wenn keine deutschen Texte übernommen werden sollen","Replace by an invalid language key if German descriptions are not wanted","Sprache 1:","DEU","durch ungültigen Sprachschlüssel ersetzen, wenn keine deutschen Texte übernommen werden sollen","Replace by an invalid language key if German descriptions are not wanted","Sprache 1:","DEU","durch ungültigen Sprachschlüssel ersetzen, wenn keine deutschen Texte übernommen werden sollen","Replace by an invalid language key if German descriptions are not wanted","Sprache 1:","DEU","durch ungültigen Sprachschlüssel ersetzen, wenn keine deutschen Texte übernommen werden sollen","Replace by an invalid language key if German descriptions are not wanted","Sprache 1:","DEU","durch ungültigen Sprachschlüssel ersetzen, wenn keine deutschen Texte übernommen werden sollen","Replace by an invalid language key if German descriptions are not wanted","Sprache 1:","DEU","durch ungültigen Sprachschlüssel ersetzen, wenn keine deutschen Texte übernommen werden sollen","Replace by an invalid language key if German descriptions are not wanted","Sprache 1:","DEU","durch ungültigen Sprachschlüssel ersetzen, wenn keine deutschen Texte übernommen werden sollen","Replace by an invalid language key if German descriptions are not wanted","Sprache 1:","DEU","durch ungültigen Sprachschlüssel ersetzen, wenn keine deutschen Texte übernommen werden sollen","Replace by an invalid language key if German descriptions are not wanted","Sprache 1:","DEU","durch ungültigen Sprachschlüssel ersetzen, wenn keine deutschen Texte übernommen werden sollen","Replace by an invalid language key if German descriptions are not wanted","Sprache 1:","DEU","durch ungültigen Sprachschlüssel ersetzen, wenn keine deutschen Texte übernommen werden sollen","Replace by an invalid language key if German descriptions are not wanted","Sprache 1:","DEU","durch ungültigen Sprachschlüssel ersetzen, wenn keine deutschen Texte übernommen werden sollen","Replace by an invalid language key if German descriptions are not wanted","Sprache 1:","DEU","durch ungültigen Sprachschlüssel ersetzen, wenn keine deutschen Texte übernommen werden sollen","Replace by an invalid language key if German descriptions are not wanted","Sprache 1:","DEU","durch ungültigen Sprachschlüssel ersetzen, wenn keine deutschen Texte übernommen werden sollen","Replace by an invalid language key if German descriptions are not wanted","Sprache 1:","DEU","durch ungültigen Sprachschlüssel ersetzen, wenn keine deutschen Texte übernommen werden sollen","Replace by an invalid language key if German descriptions are not wanted","Sprache 1:","DEU","durch ungültigen Sprachschlüssel ersetzen, wenn keine deutschen Texte übernommen werden sollen","Replace by an invalid language key if German descriptions are not wanted","Sprache 1:","DEU","durch ungültigen Sprachschlüssel ersetzen, wenn keine deutschen Texte übernommen werden sollen","Replace by an invalid language key if German descriptions are not wanted","Sprache 1:","DEU","durch ungültigen Sprachschlüssel ersetzen, wenn keine deutschen Texte übernommen werden sollen","Replace by an invalid language key if German descriptions are not wanted","Sprache 1:","DEU","durch ungültigen Sprachschlüssel ersetzen, wenn keine deutschen Texte übernommen werden sollen","Replace by an invalid language key if German descriptions are not wanted","Sprache 1:","DEU","durch ungültigen Sprachschlüssel ersetzen, wenn keine deutschen Texte übernommen werden sollen","Replace by an invalid language key if German descriptions are not wanted","Sprache 1:","DEU","durch ungültigen Sprachschlüssel ersetzen, wenn keine deutschen Texte übernommen werden sollen","Replace by an invalid language key if German descriptions are not wanted","Sprache 1:","DEU","durch ungültigen Sprachschlüssel ersetzen, wenn keine deutschen Texte übernommen werden sollen","Replace by an invalid language key if German descriptions are not wanted","Sprache 1:","DEU","durch ungültigen Sprachschlüssel ersetzen, wenn keine deutschen Texte übernommen werden sollen","Replace by an invalid language key if German descriptions are not wanted","Sprache 1:","DEU","durch ungültigen Sprachschlüssel ersetzen, wenn keine deutschen Texte übernommen werden sollen","Replace by an invalid language key if German descriptions are not wanted","Sprache 1:","DEU","durch ungültigen Sprachschlüssel ersetzen, wenn keine deutschen Texte übernommen werden sollen","Replace by an invalid language key if German descriptions are not wanted","Sprache 1:","DEU","durch ungültigen Sprachschlüssel ersetzen, wenn keine deutschen Texte übernommen werden sollen","Replace by an invalid language key if German descriptions are not wanted","Sprache 1:","DEU","durch ungültigen Sprachschlüssel ersetzen, wenn keine deutschen Texte übernommen werden sollen","Replace by an invalid language key if German descriptions are not wanted","Sprache 1:","DEU","durch ungültigen Sprachschlüssel ersetzen, wenn keine deutschen Texte übernommen werden sollen","Replace by an invalid language key if German descriptions are not wanted","Sprache 1:","DEU","durch ungültigen Sprachschlüssel ersetzen, wenn keine deutschen Texte übernommen werden sollen","Replace by an invalid language key if German descriptions are not wanted","Sprache 1:","DEU","durch ungültigen Sprachschlüssel ersetzen, wenn keine deutschen Texte übernommen werden sollen","Replace by an invalid language key if German descriptions are not wanted","Sprache 1:","DEU","durch ungültigen Sprachschlüssel ersetzen, wenn keine deutschen Texte übernommen werden sollen","Replace by an invalid language key if German descriptions are not wanted","Sprache 1:","DEU","durch ungültigen Sprachschlüssel ersetzen, wenn keine deutschen Texte übernommen werden sollen","Replace by an invalid language key if German descriptions are not wanted","Sprache 1:","DEU","durch ungültigen Sprachschlüssel ersetzen, wenn keine deutschen Texte übernommen werden sollen","Replace by an invalid language key if German descriptions are not wanted","Sprache 1:","DEU","durch ungültigen Sprachschlüssel ersetzen, wenn keine deutschen Texte übernommen werden sollen","Replace by an invalid language key if German descriptions are not wanted","Sprache 1:","DEU","durch ungültigen Sprachschlüssel ersetzen, wenn keine deutschen Texte übernommen werden sollen","Replace by an invalid language key if German descriptions are not wanted","Sprache 1:","DEU","durch ungültigen Sprachschlüssel ersetzen, wenn keine deutschen Texte übernommen werden sollen","Replace by an invalid language key if German descriptions are not wanted","Sprache 1:","DEU","durch ungültigen Sprachschlüssel ersetzen, wenn keine deutschen Texte übernommen werden sollen","Replace by an invalid language key if German descriptions are not wanted","Sprache 1:","DEU","durch ungültigen Sprachschlüssel ersetzen, wenn keine deutschen Texte übernommen werden sollen","Replace by an invalid language key if German descriptions are not wanted","Sprache 1:","DEU","durch ungültigen Sprachschlüssel ersetzen, wenn keine deutschen Texte übernommen werden sollen","Replace by an invalid language key if German descriptions are not wanted","Sprache 1:","DEU","durch ungültigen Sprachschlüssel ersetzen, wenn keine deutschen Texte übernommen werden sollen","Replace by an invalid language key if German descriptions are not wanted","Sprache 1:","DEU","durch ungültigen Sprachschlüssel ersetzen, wenn keine deutschen Texte übernommen werden sollen","Replace by an invalid language key if German descriptions are not wanted","Sprache 1:","DEU","durch ungültigen Sprachschlüssel ersetzen, wenn keine deutschen Texte übernommen werden sollen","Replace by an invalid language key if German descriptions are not wanted","Sprache 1:","DEU","durch ungültigen Sprachschlüssel ersetzen, wenn keine deutschen Texte übernommen werden sollen","Replace by an invalid language key if German descriptions are not wanted","Sprache 1:","DEU","durch ungültigen Sprachschlüssel ersetzen, wenn keine deutschen Texte übernommen werden sollen","Replace by an invalid language key if German descriptions are not wanted","Sprache 1:","DEU","durch ungültigen Sprachschlüssel ersetzen, wenn keine deutschen Texte übernommen werden sollen","Replace by an invalid language key if German descriptions are not wanted","Sprache 1:","DEU","durch ungültigen Sprachschlüssel ersetzen, wenn keine deutschen Texte übernommen werden sollen","Replace by an invalid language key if German descriptions are not wanted","Sprache 1:","DEU","durch ungültigen Sprachschlüssel ersetzen, wenn keine deutschen Texte übernommen werden sollen","Replace by an invalid language key if German descriptions are not wanted","Sprache 1:","DEU","durch ungültigen Sprachschlüssel ersetzen, wenn keine deutschen Texte übernommen werden sollen","Replace by an invalid language key if German descriptions are not wanted","Sprache 1:","DEU","durch ungültigen Sprachschlüssel ersetzen, wenn keine deutschen Texte übernommen werden sollen","Replace by an invalid language key if German descriptions are not wanted","Sprache 1:","DEU","durch ungültigen Sprachschlüssel ersetzen, wenn keine deutschen Texte übernommen werden sollen","Replace by an invalid language key if German descriptions are not wanted","Sprache 1:","DEU","durch ungültigen Sprachschlüssel ersetzen, wenn keine deutschen Texte übernommen werden sollen","Replace by an invalid language key if German descriptions are not wanted","Sprache 1:","DEU","durch ungültigen Sprachschlüssel ersetzen, wenn keine deutschen Texte übernommen werden sollen","Replace by an invalid language key if German descriptions are not wanted","Sprache 1:","DEU","durch ungültigen Sprachschlüssel ersetzen, wenn keine deutschen Texte übernommen werden sollen","Replace by an invalid language key if German descriptions are not wanted","Sprache 1:","DEU","durch ungültigen Sprachschlüssel ersetzen, wenn keine deutschen Texte übernommen werden sollen","Replace by an invalid language key if German descriptions are not wanted","Sprache 1:","DEU","durch ungültigen Sprachschlüssel ersetzen, wenn keine deutschen Texte übernommen werden sollen","Replace by an invalid language key if German descriptions are not wanted","Sprache 1:","DEU","durch ungültigen Sprachschlüssel ersetzen, wenn keine deutschen Texte übernommen werden sollen","Replace by an invalid language key if German descriptions are not wanted","Sprache 1:","DEU","durch ungültigen Sprachschlüssel ersetzen, wenn keine deutschen Texte übernommen werden sollen","Replace by an invalid language key if German descriptions are not wanted","Sprache 1:","DEU","durch ungültigen Sprachschlüssel ersetzen, wenn keine deutschen Texte übernommen werden sollen","Replace by an invalid language key if German descriptions are not wanted","Sprache 1:","DEU","durch ungültigen Sprachschlüssel ersetzen, wenn keine deutschen Texte übernommen werden sollen","Replace by an invalid language key if German descriptions are not wanted","Sprache 1:","DEU","durch ungültigen Sprachschlüssel ersetzen, wenn keine deutschen Texte übernommen werden sollen","Replace by an invalid language key if German descriptions are not wanted","Sprache 1:","DEU","durch ungültigen Sprachschlüssel ersetzen, wenn keine deutschen Texte übernommen werden sollen","Replace by an invalid language key if German descriptions are not wanted","Sprache 1:","DEU","durch ungültigen Sprachschlüssel ersetzen, wenn keine deutschen Texte übernommen werden sollen","Replace by an invalid language key if German descriptions are not wanted","Sprache 1:","DEU","durch ungültigen Sprachschlüssel ersetzen, wenn keine deutschen Texte übernommen werden sollen","Replace by an invalid language key if German descriptions are not wanted","Sprache 1:","DEU","durch ungültigen Sprachschlüssel ersetzen, wenn keine deutschen Texte übernommen werden sollen","Replace by an invalid language key if German descriptions are not wanted","Sprache 1:","DEU","durch ungültigen Sprachschlüssel ersetzen, wenn keine deutschen Texte übernommen werden sollen","Replace by an invalid language key if German descriptions are not wanted","Sprache 1:","DEU","durch ungültigen Sprachschlüssel ersetzen, wenn keine deutschen Texte übernommen werden sollen","Replace by an invalid language key if German descriptions are not wanted","Sprache 1:","DEU","durch ungültigen Sprachschlüssel ersetzen, wenn keine deutschen Texte übernommen werden sollen","Replace by an invalid language key if German descriptions are not wanted","Sprache 1:","DEU","durch ungültigen Sprachschlüssel ersetzen, wenn keine deutschen Texte übernommen werden sollen","Replace by an invalid language key if German descriptions are not wanted","Sprache 1:","DEU","durch ungültigen Sprachschlüssel ersetzen, wenn keine deutschen Texte übernommen werden sollen","Replace by an invalid language key if German descriptions are not wanted","Sprache 1:","DEU","durch ungültigen Sprachschlüssel ersetzen, wenn keine deutschen Texte übernommen werden sollen","Replace by an invalid language key if German descriptions are not wanted","Sprache 1:","DEU","durch ungültigen Sprachschlüssel ersetzen, wenn keine deutschen Texte übernommen werden sollen","Replace by an invalid language key if German descriptions are not wanted","Sprache 1:","DEU","durch ungültigen Sprachschlüssel ersetzen, wenn keine deutschen Texte übernommen werden sollen","Replace by an invalid language key if German descriptions are not wanted","Sprache 1:","DEU","durch ungültigen Sprachschlüssel ersetzen, wenn keine deutschen Texte übernommen werden sollen","Replace by an invalid language key if German descriptions are not wanted","Sprache 1:","DEU","durch ungültigen Sprachschlüssel ersetzen, wenn keine deutschen Texte übernommen werden sollen","Replace by an invalid language key if German descriptions are not wanted","Sprache 1:","DEU","durch ungültigen Sprachschlüssel ersetzen, wenn keine deutschen Texte übernommen werden sollen","Replace by an invalid language key if German descriptions are not wanted","Sprache 1:","DEU","durch ungültigen Sprachschlüssel ersetzen, wenn keine deutschen Texte übernommen werden sollen","Replace by an invalid language key if German descriptions are not wanted","Sprache 1:","DEU","durch ungültigen Sprachschlüssel ersetzen, wenn keine deutschen Texte übernommen werden sollen","Replace by an invalid language key if German descriptions are not wanted","Sprache 1:","DEU","durch ungültigen Sprachschlüssel ersetzen, wenn keine deutschen Texte übernommen werden sollen","Replace by an invalid language key if German descriptions are not wanted","Sprache 1:","DEU","durch ungültigen Sprachschlüssel ersetzen, wenn keine deutschen Texte übernommen werden sollen","Replace by an invalid language key if German descriptions are not wanted","Sprache 1:","DEU","durch ungültigen Sprachschlüssel ersetzen, wenn keine deutschen Texte übernommen werden sollen","Replace by an invalid language key if German descriptions are not wanted","Sprache 1:","DEU","durch ungültigen Sprachschlüssel ersetzen, wenn keine deutschen Texte übernommen werden sollen","Replace by an invalid language key if German descriptions are not wanted","Sprache 1:","DEU","durch ungültigen Sprachschlüssel ersetzen, wenn keine deutschen Texte übernommen werden sollen","Replace by an invalid language key if German descriptions are not wanted","Sprache 1:","DEU","durch ungültigen Sprachschlüssel ersetzen, wenn keine deutschen Texte übernommen werden sollen","Replace by an invalid language key if German descriptions are not wanted","Sprache 1:","DEU","durch ungültigen Sprachschlüssel ersetzen, wenn keine deutschen Texte übernommen werden sollen","Replace by an invalid language key if German descriptions are not wanted","Sprache 1:","DEU","durch ungültigen Sprachschlüssel ersetzen, wenn keine deutschen Texte übernommen werden sollen","Replace by an invalid language key if German descriptions are not wanted","Sprache 1:","DEU","durch ungültigen Sprachschlüssel ersetzen, wenn keine deutschen Texte übernommen werden sollen","Replace by an invalid language key if German descriptions are not wanted","Sprache 1:","DEU","durch ungültigen Sprachschlüssel ersetzen, wenn keine deutschen Texte übernommen werden sollen","Replace by an invalid language key if German descriptions are not wanted","Sprache 1:","DEU","durch ungültigen Sprachschlüssel ersetzen, wenn keine deutschen Texte übernommen werden sollen","Replace by an invalid language key if German descriptions are not wanted","Sprache 1:","DEU","durch ungültigen Sprachschlüssel ersetzen, wenn keine deutschen Texte übernommen werden sollen","Replace by an invalid language key if German descriptions are not wanted","Sprache 1:","DEU","durch ungültigen Sprachschlüssel ersetzen, wenn keine deutschen Texte übernommen werden sollen","Replace by an invalid language key if German descriptions are not wanted","Sprache 1:","DEU","durch ungültigen Sprachschlüssel ersetzen, wenn keine deutschen Texte übernommen werden sollen","Replace by an invalid language key if German descriptions are not wanted","Sprache 1:","DEU","durch ungültigen Sprachschlüssel ersetzen, wenn keine deutschen Texte übernommen werden sollen","Replace by an invalid language key if German descriptions are not wanted","Sprache 1:","DEU","durch ungültigen Sprachschlüssel ersetzen, wenn keine deutschen Texte übernommen werden sollen","Replace by an invalid language key if German descriptions are not wanted","Sprache 1:","DEU","durch ungültigen Sprachschlüssel ersetzen, wenn keine deutschen Texte übernommen werden sollen","Replace by an invalid language key if German descriptions are not wanted","Sprache 1:","DEU","durch ungültigen Sprachschlüssel ersetzen, wenn keine deutschen Texte übernommen werden sollen","Replace by an invalid language key if German descriptions are not wanted","Sprache 1:","DEU","durch ungültigen Sprachschlüssel ersetzen, wenn keine deutschen Texte übernommen werden sollen","Replace by an invalid language key if German descriptions are not wanted","Sprache 1:","DEU","durch ungültigen Sprachschlüssel ersetzen, wenn keine deutschen Texte übernommen werden sollen","Replace by an invalid language key if German descriptions are not wanted","Sprache 1:","DEU","durch ungültigen Sprachschlüssel ersetzen, wenn keine deutschen Texte übernommen werden sollen","Replace by an invalid language key if German descriptions are not wanted","Sprache 1:","DEU","durch ungültigen Sprachschlüssel ersetzen, wenn keine deutschen Texte übernommen werden sollen","Replace by an invalid language key if German descriptions are not wanted","Sprache 1:","DEU","durch ungültigen Sprachschlüssel ersetzen, wenn keine deutschen Texte übernommen werden sollen","Replace by an invalid language key if German descriptions are not wanted","Sprache 1:","DEU","durch ungültigen Sprachschlüssel ersetzen, wenn keine deutschen Texte übernommen werden sollen","Replace by an invalid language key if German descriptions are not wanted","Sprache 1:","DEU","durch ungültigen Sprachschlüssel ersetzen, wenn keine deutschen Texte übernommen werden sollen","Replace by an invalid language key if German descriptions are not wanted","Sprache 1:","DEU","durch ungültigen Sprachschlüssel ersetzen, wenn keine deutschen Texte übernommen werden sollen","Replace by an invalid language key if German descriptions are not wanted","Sprache 1:","DEU","durch ungültigen Sprachschlüssel ersetzen, wenn keine deutschen Texte übernommen werden sollen","Replace by an invalid language key if German descriptions are not wanted","Sprache 1:","DEU","durch ungültigen Sprachschlüssel ersetzen, wenn keine deutschen Texte übernommen werden sollen","Replace by an invalid language key if German descriptions are not wanted","Sprache 1:","DEU","durch ungültigen Sprachschlüssel ersetzen, wenn keine deutschen Texte übernommen werden sollen","Replace by an invalid language key if German descriptions are not wanted","Sprache 1:","DEU","durch ungültigen Sprachschlüssel ersetzen, wenn keine deutschen Texte übernommen werden sollen","Replace by an invalid language key if German descriptions are not wanted","Sprache 1:","DEU","durch ungültigen Sprachschlüssel ersetzen, wenn keine deutschen Texte übernommen werden sollen","Replace by an invalid language key if German descriptions are not wanted","Sprache 1:","DEU","durch ungültigen Sprachschlüssel ersetzen, wenn keine deutschen Texte übernommen werden sollen","Replace by an invalid language key if German descriptions are not wanted","Sprache 1:","DEU","durch ungültigen Sprachschlüssel ersetzen, wenn keine deutschen Texte übernommen werden sollen","Replace by an invalid language key if German descriptions are not wanted","Sprache 1:","DEU","durch ungültigen Sprachschlüssel ersetzen, wenn keine deutschen Texte übernommen werden sollen","Replace by an invalid language key if German descriptions are not wanted","Sprache 1:","DEU","durch ungültigen Sprachschlüssel ersetzen, wenn keine deutschen Texte übernommen werden sollen","Replace by an invalid language key if German descriptions are not wanted","Sprache 1:","DEU","durch ungültigen Sprachschlüssel ersetzen, wenn keine deutschen Texte übernommen werden sollen","Replace by an invalid language key if German descriptions are not wanted","Sprache 1:","DEU","durch ungültigen Sprachschlüssel ersetzen, wenn keine deutschen Texte übernommen werden sollen","Replace by an invalid language key if German descriptions are not wanted","Sprache 1:","DEU","durch ungültigen Sprachschlüssel ersetzen, wenn keine deutschen Texte übernommen werden sollen","Replace by an invalid language key if German descriptions are not wanted","Sprache 1:","DEU","durch ungültigen Sprachschlüssel ersetzen, wenn keine deutschen Texte übernommen werden sollen","Replace by an invalid language key if German descriptions are not wanted","Sprache 1:","DEU","durch ungültigen Sprachschlüssel ersetzen, wenn keine deutschen Texte übernommen werden sollen","Replace by an invalid language key if German descriptions are not wanted","Sprache 1:","DEU","durch ungültigen Sprachschlüssel ersetzen, wenn keine deutschen Texte übernommen werden sollen","Replace by an invalid language key if German descriptions are not wanted","Sprache 1:","DEU","durch ungültigen Sprachschlüssel ersetzen, wenn keine deutschen Texte übernommen werden sollen","Replace by an invalid language key if German descriptions are not wanted","Sprache 1:","DEU","durch ungültigen Sprachschlüssel ersetzen, wenn keine deutschen Texte übernommen werden sollen","Replace by an invalid language key if German descriptions are not wanted","Sprache 1:","DEU","durch ungültigen Sprachschlüssel ersetzen, wenn keine deutschen Texte übernommen werden sollen","Replace by an invalid language key if German descriptions are not wanted","Sprache 1:","DEU","durch ungültigen Sprachschlüssel ersetzen, wenn keine deutschen Texte übernommen werden sollen","Replace by an invalid language key if German descriptions are not wanted","Sprache 1:","DEU","durch ungültigen Sprachschlüssel ersetzen, wenn keine deutschen Texte übernommen werden sollen","Replace by an invalid language key if German descriptions are not wanted","Sprache 1:","DEU","durch ungültigen Sprachschlüssel ersetzen, wenn keine deutschen Texte übernommen werden sollen","Replace by an invalid language key if German descriptions are not wanted","Sprache 1:","DEU","durch ungültigen Sprachschlüssel ersetzen, wenn keine deutschen Texte übernommen werden sollen","Replace by an invalid language key if German descriptions are not wanted","Sprache 1:","DEU","durch ungültigen Sprachschlüssel ersetzen, wenn keine deutschen Texte übernommen werden sollen","Replace by an invalid language key if German descriptions are not wanted","Sprache 1:","DEU","durch ungültigen Sprachschlüssel ersetzen, wenn keine deutschen Texte übernommen werden sollen","Replace by an invalid language key if German descriptions are not wanted","Sprache 1:","DEU","durch ungültigen Sprachschlüssel ersetzen, wenn keine deutschen Texte übernommen werden sollen","Replace by an invalid language key if German descriptions are not wanted","Sprache 1:","DEU","durch ungültigen Sprachschlüssel ersetzen, wenn keine deutschen Texte übernommen werden sollen","Replace by an invalid language key if German descriptions are not wanted","Sprache 1:","DEU","durch ungültigen Sprachschlüssel ersetzen, wenn keine deutschen Texte übernommen werden sollen","Replace by an invalid language key if German descriptions are not wanted","Sprache 1:","DEU","durch ungültigen Sprachschlüssel ersetzen, wenn keine deutschen Texte übernommen werden sollen","Replace by an invalid language key if German descriptions are not wanted","Sprache 1:","DEU","durch ungültigen Sprachschlüssel ersetzen, wenn keine deutschen Texte übernommen werden sollen","Replace by an invalid language key if German descriptions are not wanted","Sprache 1:","DEU","durch ungültigen Sprachschlüssel ersetzen, wenn keine deutschen Texte übernommen werden sollen","Replace by an invalid language key if German descriptions are not wanted","Sprache 1:","DEU","durch ungültigen Sprachschlüssel ersetzen, wenn keine deutschen Texte übernommen werden sollen","Replace by an invalid language key if German descriptions are not wanted","Sprache 1:","DEU","durch ungültigen Sprachschlüssel ersetzen, wenn keine deutschen Texte übernommen werden sollen","Replace by an invalid language key if German descriptions are not wanted","Sprache 1:","DEU","durch ungültigen Sprachschlüssel ersetzen, wenn keine deutschen Texte übernommen werden sollen","Replace by an invalid language key if German descriptions are not wanted","Sprache 1:","DEU","durch ungültigen Sprachschlüssel ersetzen, wenn keine deutschen Texte übernommen werden sollen","Replace by an invalid language key if German descriptions are not wanted","Sprache 1:","DEU","durch ungültigen Sprachschlüssel ersetzen, wenn keine deutschen Texte übernommen werden sollen","Replace by an invalid language key if German descriptions are not wanted","Sprache 1:","DEU","durch ungültigen Sprachschlüssel ersetzen, wenn keine deutschen Texte übernommen werden sollen","Replace by an invalid language key if German descriptions are not wanted","Sprache 1:","DEU","durch ungültigen Sprachschlüssel ersetzen, wenn keine deutschen Texte übernommen werden sollen","Replace by an invalid language key if German descriptions are not wanted","Sprache 1:","DEU","durch ungültigen Sprachschlüssel ersetzen, wenn keine deutschen Texte übernommen werden sollen","Replace by an invalid language key if German descriptions are not wanted","Sprache 1:","DEU","durch ungültigen Sprachschlüssel ersetzen, wenn keine deutschen Texte übernommen werden sollen","Replace by an invalid language key if German descriptions are not wanted","Sprache 1:","DEU","durch ungültigen Sprachschlüssel ersetzen, wenn keine deutschen Texte übernommen werden sollen","Replace by an invalid language key if German descriptions are not wanted","Sprache 1:","DEU","durch ungültigen Sprachschlüssel ersetzen, wenn keine deutschen Texte übernommen werden sollen","Replace by an invalid language key if German descriptions are not wanted","Sprache 1:","DEU","durch ungültigen Sprachschlüssel ersetzen, wenn keine deutschen Texte übernommen werden sollen","Replace by an invalid language key if German descriptions are not wanted","Sprache 1:","DEU","durch ungültigen Sprachschlüssel ersetzen, wenn keine deutschen Texte übernommen werden sollen","Replace by an invalid language key if German descriptions are not wanted","Sprache 1:","DEU","durch ungültigen Sprachschlüssel ersetzen, wenn keine deutschen Texte übernommen werden sollen","Replace by an invalid language key if German descriptions are not wanted","Sprache 1:","DEU","durch ungültigen Sprachschlüssel ersetzen, wenn keine deutschen Texte übernommen werden sollen","Replace by an invalid language key if German descriptions are not wanted","Sprache 1:","DEU","durch ungültigen Sprachschlüssel ersetzen, wenn keine deutschen Texte übernommen werden sollen","Replace by an invalid language key if German descriptions are not wanted","Sprache 1:","DEU","durch ungültigen Sprachschlüssel ersetzen, wenn keine deutschen Texte übernommen werden sollen","Replace by an invalid language key if German descriptions are not wanted","Sprache 1:","DEU","durch ungültigen Sprachschlüssel ersetzen, wenn keine deutschen Texte übernommen werden sollen","Replace by an invalid language key if German descriptions are not wanted","Sprache 1:","DEU","durch ungültigen Sprachschlüssel ersetzen, wenn keine deutschen Texte übernommen werden sollen","Replace by an invalid language key if German descriptions are not wanted","Sprache 1:","DEU","durch ungültigen Sprachschlüssel ersetzen, wenn keine deutschen Texte übernommen werden sollen","Replace by an invalid language key if German descriptions are not wanted","Sprache 1:","DEU","durch ungültigen Sprachschlüssel ersetzen, wenn keine deutschen Texte übernommen werden sollen","Replace by an invalid language key if German descriptions are not wanted","Sprache 1:","DEU","durch ungültigen Sprachschlüssel ersetzen, wenn keine deutschen Texte übernommen werden sollen","Replace by an invalid language key if German descriptions are not wanted","Sprache 1:","DEU","durch ungültigen Sprachschlüssel ersetzen, wenn keine deutschen Texte übernommen werden sollen","Replace by an invalid language key if German descriptions are not wanted","Sprache 1:","DEU","durch ungültigen Sprachschlüssel ersetzen, wenn keine deutschen Texte übernommen werden sollen","Replace by an invalid language key if German descriptions are not wanted","Sprache 1:","DEU","durch ungültigen Sprachschlüssel ersetzen, wenn keine deutschen Texte übernommen werden sollen","Replace by an invalid language key if German descriptions are not wanted","Sprache 1:","DEU","durch ungültigen Sprachschlüssel ersetzen, wenn keine deutschen Texte übernommen werden sollen","Replace by an invalid language key if German descriptions are not wanted","Sprache 1:","DEU","durch ungültigen Sprachschlüssel ersetzen, wenn keine deutschen Texte übernommen werden sollen","Replace by an invalid language key if German descriptions are not wanted","Sprache 1:","DEU","durch ungültigen Sprachschlüssel ersetzen, wenn keine deutschen Texte übernommen werden sollen","Replace by an invalid language key if German descriptions are not wanted","Sprache 1:","DEU","durch ungültigen Sprachschlüssel ersetzen, wenn keine deutschen Texte übernommen werden sollen","Replace by an invalid language key if German descriptions are not wanted","Sprache 1:","DEU","durch ungültigen Sprachschlüssel ersetzen, wenn keine deutschen Texte übernommen werden sollen","Replace by an invalid language key if German descriptions are not wanted","Sprache 1:","DEU","durch ungültigen Sprachschlüssel ersetzen, wenn keine deutschen Texte übernommen werden sollen","Replace by an invalid language key if German descriptions are not wanted","Sprache 1:","DEU","durch ungültigen Sprachschlüssel ersetzen, wenn keine deutschen Texte übernommen werden sollen","Replace by an invalid language key if German descriptions are not wanted","Sprache 1:","DEU","durch ungültigen Sprachschlüssel ersetzen, wenn keine deutschen Texte übernommen werden sollen","Replace by an invalid language key if German descriptions are not wanted","Sprache 1:","DEU","durch ungültigen Sprachschlüssel ersetzen, wenn keine deutschen Texte übernommen werden sollen","Replace by an invalid language key if German descriptions are not wanted","Sprache 1:","DEU","durch ungültigen Sprachschlüssel ersetzen, wenn keine deutschen Texte übernommen werden sollen","Replace by an invalid language key if German descriptions are not wanted","Sprache 1:","DEU","durch ungültigen Sprachschlüssel ersetzen, wenn keine deutschen Texte übernommen werden sollen","Replace by an invalid language key if German descriptions are not wanted","Sprache 1:","DEU","durch ungültigen Sprachschlüssel ersetzen, wenn keine deutschen Texte übernommen werden sollen","Replace by an invalid language key if German descriptions are not wanted","Sprache 1:","DEU","durch ungültigen Sprachschlüssel ersetzen, wenn keine deutschen Texte übernommen werden sollen","Replace by an invalid language key if German descriptions are not wanted","Sprache 1:","DEU","durch ungültigen Sprachschlüssel ersetzen, wenn keine deutschen Texte übernommen werden sollen","Replace by an invalid language key if German descriptions are not wanted","Sprache 1:","DEU","durch ungültigen Sprachschlüssel ersetzen, wenn keine deutschen Texte übernommen werden sollen","Replace by an invalid language key if German descriptions are not wanted","Sprache 1:","DEU","durch ungültigen Sprachschlüssel ersetzen, wenn keine deutschen Texte übernommen werden sollen","Replace by an invalid language key if German descriptions are not wanted","Sprache 1:","DEU","durch ungültigen Sprachschlüssel ersetzen, wenn keine deutschen Texte übernommen werden sollen","Replace by an invalid language key if German descriptions are not wanted","Sprache 1:","DEU","durch ungültigen Sprachschlüssel ersetzen, wenn keine deutschen Texte übernommen werden sollen","Replace by an invalid language key if German descriptions are not wanted","Sprache 1:","DEU","durch ungültigen Sprachschlüssel ersetzen, wenn keine deutschen Texte übernommen werden sollen","Replace by an invalid language key if German descriptions are not wanted","Sprache 1:","DEU","durch ungültigen Sprachschlüssel ersetzen, wenn keine deutschen Texte übernommen werden sollen","Replace by an invalid language key if German descriptions are not wanted","Sprache 1:","DEU","durch ungültigen Sprachschlüssel ersetzen, wenn keine deutschen Texte übernommen werden sollen","Replace by an invalid language key if German descriptions are not wanted","Sprache 1:","DEU","durch ungültigen Sprachschlüssel ersetzen, wenn keine deutschen Texte übernommen werden sollen","Replace by an invalid language key if German descriptions are not wanted","Sprache 1:","DEU","durch ungültigen Sprachschlüssel ersetzen, wenn keine deutschen Texte übernommen werden sollen","Replace by an invalid language key if German descriptions are not wanted","Sprache 1:","DEU","durch ungültigen Sprachschlüssel ersetzen, wenn keine deutschen Texte übernommen werden sollen","Replace by an invalid language key if German descriptions are not wanted","Sprache 1:","DEU","durch ungültigen Sprachschlüssel ersetzen, wenn keine deutschen Texte übernommen werden sollen","Replace by an invalid language key if German descriptions are not wanted","Sprache 1:","DEU","durch ungültigen Sprachschlüssel ersetzen, wenn keine deutschen Texte übernommen werden sollen","Replace by an invalid language key if German descriptions are not wanted","Sprache 1:","DEU","durch ungültigen Sprachschlüssel ersetzen, wenn keine deutschen Texte übernommen werden sollen","Replace by an invalid language key if German descriptions are not wanted","Sprache 1:","DEU","durch ungültigen Sprachschlüssel ersetzen, wenn keine deutschen Texte übernommen werden sollen","Replace by an invalid language key if German descriptions are not wanted","Sprache 1:","DEU","durch ungültigen Sprachschlüssel ersetzen, wenn keine deutschen Texte übernommen werden sollen","Replace by an invalid language key if German descriptions are not wanted","Sprache 1:","DEU","durch ungültigen Sprachschlüssel ersetzen, wenn keine deutschen Texte übernommen werden sollen","Replace by an invalid language key if German descriptions are not wanted","Sprache 1:","DEU","durch ungültigen Sprachschlüssel ersetzen, wenn keine deutschen Texte übernommen werden sollen","Replace by an invalid language key if German descriptions are not wanted","Sprache 1:","DEU","durch ungültigen Sprachschlüssel ersetzen, wenn keine deutschen Texte übernommen werden sollen","Replace by an invalid language key if German descriptions are not wanted","Sprache 1:","DEU","durch ungültigen Sprachschlüssel ersetzen, wenn keine deutschen Texte übernommen werden sollen","Replace by an invalid language key if German descriptions are not wanted","Sprache 1:","DEU","durch ungültigen Sprachschlüssel ersetzen, wenn keine deutschen Texte übernommen werden sollen","Replace by an invalid language key if German descriptions are not wanted","Sprache 1:","DEU","durch ungültigen Sprachschlüssel ersetzen, wenn keine deutschen Texte übernommen werden sollen","Replace by an invalid language key if German descriptions are not wanted","Sprache 1:","DEU","durch ungültigen Sprachschlüssel ersetzen, wenn keine deutschen Texte übernommen werden sollen","Replace by an invalid language key if German descriptions are not wanted","Sprache 1:","DEU","durch ungültigen Sprachschlüssel ersetzen, wenn keine deutschen Texte übernommen werden sollen","Replace by an invalid language key if German descriptions are not wanted","Sprache 1:","DEU","durch ungültigen Sprachschlüssel ersetzen, wenn keine deutschen Texte übernommen werden sollen","Replace by an invalid language key if German descriptions are not wanted","Sprache 1:","DEU","durch ungültigen Sprachschlüssel ersetzen, wenn keine deutschen Texte übernommen werden sollen","Replace by an invalid language key if German descriptions are not wanted","Sprache 1:","DEU","durch ungültigen Sprachschlüssel ersetzen, wenn keine deutschen Texte übernommen werden sollen","Replace by an invalid language key if German descriptions are not wanted","Sprache 1:","DEU","durch ungültigen Sprachschlüssel ersetzen, wenn keine deutschen Texte übernommen werden sollen","Replace by an invalid language key if German descriptions are not wanted","Sprache 1:","DEU","durch ungültigen Sprachschlüssel ersetzen, wenn keine deutschen Texte übernommen werden sollen","Replace by an invalid language key if German descriptions are not wanted","Sprache 1:","DEU","durch ungültigen Sprachschlüssel ersetzen, wenn keine deutschen Texte übernommen werden sollen","Replace by an invalid language key if German descriptions are not wanted","Sprache 1:","DEU","durch ungültigen Sprachschlüssel ersetzen, wenn keine deutschen Texte übernommen werden sollen","Replace by an invalid language key if German descriptions are not wanted","Sprache 1:","DEU","durch ungültigen Sprachschlüssel ersetzen, wenn keine deutschen Texte übernommen werden sollen","Replace by an invalid language key if German descriptions are not wanted","Sprache 1:","DEU","durch ungültigen Sprachschlüssel ersetzen, wenn keine deutschen Texte übernommen werden sollen","Replace by an invalid language key if German descriptions are not wanted","Sprache 1:","DEU","durch ungültigen Sprachschlüssel ersetzen, wenn keine deutschen Texte übernommen werden sollen","Replace by an invalid language key if German descriptions are not wanted","Sprache 1:","DEU","durch ungültigen Sprachschlüssel ersetzen, wenn keine deutschen Texte übernommen werden sollen","Replace by an invalid language key if German descriptions are not wanted","Sprache 1:","DEU","durch ungültigen Sprachschlüssel ersetzen, wenn keine deutschen Texte übernommen werden sollen","Replace by an invalid language key if German descriptions are not wanted","Sprache 1:","DEU","durch ungültigen Sprachschlüssel ersetzen, wenn keine deutschen Texte übernommen werden sollen","Replace by an invalid language key if German descriptions are not wanted","Sprache 1:","DEU","durch ungültigen Sprachschlüssel ersetzen, wenn keine deutschen Texte übernommen werden sollen","Replace by an invalid language key if German descriptions are not wanted","Sprache 1:","DEU","durch ungültigen Sprachschlüssel ersetzen, wenn keine deutschen Texte übernommen werden sollen","Replace by an invalid language key if German descriptions are not wanted","Sprache 1:","DEU","durch ungültigen Sprachschlüssel ersetzen, wenn keine deutschen Texte übernommen werden sollen","Replace by an invalid language key if German descriptions are not wanted","Sprache 1:","DEU","durch ungültigen Sprachschlüssel ersetzen, wenn keine deutschen Texte übernommen werden sollen","Replace by an invalid language key if German descriptions are not wanted","Sprache 1:","DEU","durch ungültigen Sprachschlüssel ersetzen, wenn keine deutschen Texte übernommen werden sollen","Replace by an invalid language key if German descriptions are not wanted","Sprache 1:","DEU","durch ungültigen Sprachschlüssel ersetzen, wenn keine deutschen Texte übernommen werden sollen","Replace by an invalid language key if German descriptions are not wanted","Sprache 1:","DEU","durch ungültigen Sprachschlüssel ersetzen, wenn keine deutschen Texte übernommen werden sollen","Replace by an invalid language key if German descriptions are not wanted","Sprache 1:","DEU","durch ungültigen Sprachschlüssel ersetzen, wenn keine deutschen Texte übernommen werden sollen","Replace by an invalid language key if German descriptions are not wanted","Sprache 1:","DEU","durch ungültigen Sprachschlüssel ersetzen, wenn keine deutschen Texte übernommen werden sollen","Replace by an invalid language key if German descriptions are not wanted","Sprache 1:","DEU","durch ungültigen Sprachschlüssel ersetzen, wenn keine deutschen Texte übernommen werden sollen","Replace by an invalid language key if German descriptions are not wanted","Sprache 1:","DEU","durch ungültigen Sprachschlüssel ersetzen, wenn keine deutschen Texte übernommen werden sollen","Replace by an invalid language key if German descriptions are not wanted","Sprache 1:","DEU","durch ungültigen Sprachschlüssel ersetzen, wenn keine deutschen Texte übernommen werden sollen","Replace by an invalid language key if German descriptions are not wanted","Sprache 1:","DEU","durch ungültigen Sprachschlüssel ersetzen, wenn keine deutschen Texte übernommen werden sollen","Replace by an invalid language key if German descriptions are not wanted","Sprache 1:","DEU","durch ungültigen Sprachschlüssel ersetzen, wenn keine deutschen Texte übernommen werden sollen","Replace by an invalid language key if German descriptions are not wanted","Sprache 1:","DEU","durch ungültigen Sprachschlüssel ersetzen, wenn keine deutschen Texte übernommen werden sollen","Replace by an invalid language key if German descriptions are not wanted","Sprache 1:","DEU","durch ungültigen Sprachschlüssel ersetzen, wenn keine deutschen Texte übernommen werden sollen","Replace by an invalid language key if German descriptions are not wanted","Sprache 1:","DEU","durch ungültigen Sprachschlüssel ersetzen, wenn keine deutschen Texte übernommen werden sollen","Replace by an invalid language key if German descriptions are not wanted","Sprache 1:","DEU","durch ungültigen Sprachschlüssel ersetzen, wenn keine deutschen Texte übernommen werden sollen","Replace by an invalid language key if German descriptions are not wanted","Sprache 1:","DEU","durch ungültigen Sprachschlüssel ersetzen, wenn keine deutschen Texte übernommen werden sollen","Replace by an invalid language key if German descriptions are not wanted","Sprache 1:","DEU","durch ungültigen Sprachschlüssel ersetzen, wenn keine deutschen Texte übernommen werden sollen","Replace by an invalid language key if German descriptions are not wanted","Sprache 1:","DEU","durch ungültigen Sprachschlüssel ersetzen, wenn keine deutschen Texte übernommen werden sollen","Replace by an invalid language key if German descriptions are not wanted","Sprache 1:","DEU","durch ungültigen Sprachschlüssel ersetzen, wenn keine deutschen Texte übernommen werden sollen","Replace by an invalid language key if German descriptions are not wanted","Sprache 1:","DEU","durch ungültigen Sprachschlüssel ersetzen, wenn keine deutschen Texte übernommen werden sollen","Replace by an invalid language key if German descriptions are not wanted","Sprache 1:","DEU","durch ungültigen Sprachschlüssel ersetzen, wenn keine deutschen Texte übernommen werden sollen","Replace by an invalid language key if German descriptions are not wanted","Sprache 1:","DEU","durch ungültigen Sprachschlüssel ersetzen, wenn keine deutschen Texte übernommen werden sollen","Replace by an invalid language key if German descriptions are not wanted","Sprache 1:","DEU","durch ungültigen Sprachschlüssel ersetzen, wenn keine deutschen Texte übernommen werden sollen","Replace by an invalid language key if German descriptions are not wanted","Sprache 1:","DEU","durch ungültigen Sprachschlüssel ersetzen, wenn keine deutschen Texte übernommen werden sollen","Replace by an invalid language key if German descriptions are not wanted","Sprache 1:","DEU","durch ungültigen Sprachschlüssel ersetzen, wenn keine deutschen Texte übernommen werden sollen","Replace by an invalid language key if German descriptions are not wanted","Sprache 1:","DEU","durch ungültigen Sprachschlüssel ersetzen, wenn keine deutschen Texte übernommen werden sollen","Replace by an invalid language key if German descriptions are not wanted","Sprache 1:","DEU","durch ungültigen Sprachschlüssel ersetzen, wenn keine deutschen Texte übernommen werden sollen","Replace by an invalid language key if German descriptions are not wanted","Sprache 1:","DEU","durch ungültigen Sprachschlüssel ersetzen, wenn keine deutschen Texte übernommen werden sollen","Replace by an invalid language key if German descriptions are not wanted","Sprache 1:","DEU","durch ungültigen Sprachschlüssel ersetzen, wenn keine deutschen Texte übernommen werden sollen","Replace by an invalid language key if German descriptions are not wanted","Sprache 1:","DEU","durch ungültigen Sprachschlüssel ersetzen, wenn keine deutschen Texte übernommen werden sollen","Replace by an invalid language key if German descriptions are not wanted","Sprache 1:","DEU","durch ungültigen Sprachschlüssel ersetzen, wenn keine deutschen Texte übernommen werden sollen","Replace by an invalid language key if German descriptions are not wanted","Sprache 1:","DEU","durch ungültigen Sprachschlüssel ersetzen, wenn keine deutschen Texte übernommen werden sollen","Replace by an invalid language key if German descriptions are not wanted","Sprache 1:","DEU","durch ungültigen Sprachschlüssel ersetzen, wenn keine deutschen Texte übernommen werden sollen","Replace by an invalid language key if German descriptions are not wanted","Sprache 1:","DEU","durch ungültigen Sprachschlüssel ersetzen, wenn keine deutschen Texte übernommen werden sollen","Replace by an invalid language key if German descriptions are not wanted","Sprache 1:","DEU","durch ungültigen Sprachschlüssel ersetzen, wenn keine deutschen Texte übernommen werden sollen","Replace by an invalid language key if German descriptions are not wanted","Sprache 1:","DEU","durch ungültigen Sprachschlüssel ersetzen, wenn keine deutschen Texte übernommen werden sollen","Replace by an invalid language key if German descriptions are not wanted","Sprache 1:","DEU","durch ungültigen Sprachschlüssel ersetzen, wenn keine deutschen Texte übernommen werden sollen","Replace by an invalid language key if German descriptions are not wanted","Sprache 1:","DEU","durch ungültigen Sprachschlüssel ersetzen, wenn keine deutschen Texte übernommen werden sollen","Replace by an invalid language key if German descriptions are not wanted","Sprache 1:","DEU","durch ungültigen Sprachschlüssel ersetzen, wenn keine deutschen Texte übernommen werden sollen","Replace by an invalid language key if German descriptions are not wanted","Sprache 1:","DEU","durch ungültigen Sprachschlüssel ersetzen, wenn keine deutschen Texte übernommen werden sollen","Replace by an invalid language key if German descriptions are not wanted","Sprache 1:","DEU","durch ungültigen Sprachschlüssel ersetzen, wenn keine deutschen Texte übernommen werden sollen","Replace by an invalid language key if German descriptions are not wanted","Sprache 1:","DEU","durch ungültigen Sprachschlüssel ersetzen, wenn keine deutschen Texte übernommen werden sollen","Replace by an invalid language key if German descriptions are not wanted","Sprache 1:","DEU","durch ungültigen Sprachschlüssel ersetzen, wenn keine deutschen Texte übernommen werden sollen","Replace by an invalid language key if German descriptions are not wanted","Sprache 1:","DEU","durch ungültigen Sprachschlüssel ersetzen, wenn keine deutschen Texte übernommen werden sollen","Replace by an invalid language key if German descriptions are not wanted","Sprache 1:","DEU","durch ungültigen Sprachschlüssel ersetzen, wenn keine deutschen Texte übernommen werden sollen","Replace by an invalid language key if German descriptions are not wanted","Sprache 1:","DEU","durch ungültigen Sprachschlüssel ersetzen, wenn keine deutschen Texte übernommen werden sollen","Replace by an invalid language key if German descriptions are not wanted","Sprache 1:","DEU","durch ungültigen Sprachschlüssel ersetzen, wenn keine deutschen Texte übernommen werden sollen","Replace by an invalid language key if German descriptions are not wanted","Sprache 1:","DEU","durch ungültigen Sprachschlüssel ersetzen, wenn keine deutschen Texte übernommen werden sollen","Replace by an invalid language key if German descriptions are not wanted","Sprache 1:","DEU","durch ungültigen Sprachschlüssel ersetzen, wenn keine deutschen Texte übernommen werden sollen","Replace by an invalid language key if German descriptions are not wanted","Sprache 1:","DEU","durch ungültigen Sprachschlüssel ersetzen, wenn keine deutschen Texte übernommen werden sollen","Replace by an invalid language key if German descriptions are not wanted","Sprache 1:","DEU","durch ungültigen Sprachschlüssel ersetzen, wenn keine deutschen Texte übernommen werden sollen","Replace by an invalid language key if German descriptions are not wanted","Sprache 1:","DEU","durch ungültigen Sprachschlüssel ersetzen, wenn keine deutschen Texte übernommen werden sollen","Replace by an invalid language key if German descriptions are not wanted","Sprache 1:","DEU","durch ungültigen Sprachschlüssel ersetzen, wenn keine deutschen Texte übernommen werden sollen","Replace by an invalid language key if German descriptions are not wanted","Sprache 1:","DEU","durch ungültigen Sprachschlüssel ersetzen, wenn keine deutschen Texte übernommen werden sollen","Replace by an invalid language key if German descriptions are not wanted","Sprache 1:","DEU","durch ungültigen Sprachschlüssel ersetzen, wenn keine deutschen Texte übernommen werden sollen","Replace by an invalid language key if German descriptions are not wanted","Sprache 1:","DEU","durch ungültigen Sprachschlüssel ersetzen, wenn keine deutschen Texte übernommen werden sollen","Replace by an invalid language key if German descriptions are not wanted","Sprache 1:","DEU","durch ungültigen Sprachschlüssel ersetzen, wenn keine deutschen Texte übernommen werden sollen","Replace by an invalid language key if German descriptions are not wanted","Sprache 1:","DEU","durch ungültigen Sprachschlüssel ersetzen, wenn keine deutschen Texte übernommen werden sollen","Replace by an invalid language key if German descriptions are not wanted","Sprache 1:","DEU","durch ungültigen Sprachschlüssel ersetzen, wenn keine deutschen Texte übernommen werden sollen","Replace by an invalid language key if German descriptions are not wanted","Sprache 1:","DEU","durch ungültigen Sprachschlüssel ersetzen, wenn keine deutschen Texte übernommen werden sollen","Replace by an invalid language key if German descriptions are not wanted","Sprache 1:","DEU","durch ungültigen Sprachschlüssel ersetzen, wenn keine deutschen Texte übernommen werden sollen","Replace by an invalid language key if German descriptions are not wanted","Sprache 1:","DEU","durch ungültigen Sprachschlüssel ersetzen, wenn keine deutschen Texte übernommen werden sollen","Replace by an invalid language key if German descriptions are not wanted","Sprache 1:","DEU","durch ungültigen Sprachschlüssel ersetzen, wenn keine deutschen Texte übernommen werden sollen","Replace by an invalid language key if German descriptions are not wanted","Sprache 1:","DEU","durch ungültigen Sprachschlüssel ersetzen, wenn keine deutschen Texte übernommen werden sollen","Replace by an invalid language key if German descriptions are not wanted","Sprache 1:","DEU","durch ungültigen Sprachschlüssel ersetzen, wenn keine deutschen Texte übernommen werden sollen","Replace by an invalid language key if German descriptions are not wanted","Sprache 1:","DEU","durch ungültigen Sprachschlüssel ersetzen, wenn keine deutschen Texte übernommen werden sollen","Replace by an invalid language key if German descriptions are not wanted","Sprache 1:","DEU","durch ungültigen Sprachschlüssel ersetzen, wenn keine deutschen Texte übernommen werden sollen","Replace by an invalid language key if German descriptions are not wanted","Sprache 1:","DEU","durch ungültigen Sprachschlüssel ersetzen, wenn keine deutschen Texte übernommen werden sollen","Replace by an invalid language key if German descriptions are not wanted","Sprache 1:","DEU","durch ungültigen Sprachschlüssel ersetzen, wenn keine deutschen Texte übernommen werden sollen","Replace by an invalid language key if German descriptions are not wanted","Sprache 1:","DEU","durch ungültigen Sprachschlüssel ersetzen, wenn keine deutschen Texte übernommen werden sollen","Replace by an invalid language key if German descriptions are not wanted","Sprache 1:","DEU","durch ungültigen Sprachschlüssel ersetzen, wenn keine deutschen Texte übernommen werden sollen","Replace by an invalid language key if German descriptions are not wanted","Sprache 1:","DEU","durch ungültigen Sprachschlüssel ersetzen, wenn keine deutschen Texte übernommen werden sollen","Replace by an invalid language key if German descriptions are not wanted","Sprache 1:","DEU","durch ungültigen Sprachschlüssel ersetzen, wenn keine deutschen Texte übernommen werden sollen","Replace by an invalid language key if German descriptions are not wanted","Sprache 1:","DEU","durch ungültigen Sprachschlüssel ersetzen, wenn keine deutschen Texte übernommen werden sollen","Replace by an invalid language key if German descriptions are not wanted","Sprache 1:","DEU","durch ungültigen Sprachschlüssel ersetzen, wenn keine deutschen Texte übernommen werden sollen","Replace by an invalid language key if German descriptions are not wanted","Sprache 1:","DEU","durch ungültigen Sprachschlüssel ersetzen, wenn keine deutschen Texte übernommen werden sollen","Replace by an invalid language key if German descriptions are not wanted","Sprache 1:","DEU","durch ungültigen Sprachschlüssel ersetzen, wenn keine deutschen Texte übernommen werden sollen","Replace by an invalid language key if German descriptions are not wanted","Sprache 1:","DEU","durch ungültigen Sprachschlüssel ersetzen, wenn keine deutschen Texte übernommen werden sollen","Replace by an invalid language key if German descriptions are not wanted","Sprache 1:","DEU","durch ungültigen Sprachschlüssel ersetzen, wenn keine deutschen Texte übernommen werden sollen","Replace by an invalid language key if German descriptions are not wanted","Sprache 1:","DEU","durch ungültigen Sprachschlüssel ersetzen, wenn keine deutschen Texte übernommen werden sollen","Replace by an invalid language key if German descriptions are not wanted","Sprache 1:","DEU","durch ungültigen Sprachschlüssel ersetzen, wenn keine deutschen Texte übernommen werden sollen","Replace by an invalid language key if German descriptions are not wanted","Sprache 1:","DEU","durch ungültigen Sprachschlüssel ersetzen, wenn keine deutschen Texte übernommen werden sollen","Replace by an invalid language key if German descriptions are not wanted","Sprache 1:","DEU","durch ungültigen Sprachschlüssel ersetzen, wenn keine deutschen Texte übernommen werden sollen","Replace by an invalid language key if German descriptions are not wanted","Sprache 1:","DEU","durch ungültigen Sprachschlüssel ersetzen, wenn keine deutschen Texte übernommen werden sollen","Replace by an invalid language key if German descriptions are not wanted","Sprache 1:","DEU","durch ungültigen Sprachschlüssel ersetzen, wenn keine deutschen Texte übernommen werden sollen","Replace by an invalid language key if German descriptions are not wanted","Sprache 1:","DEU","durch ungültigen Sprachschlüssel ersetzen, wenn keine deutschen Texte übernommen werden sollen","Replace by an invalid language key if German descriptions are not wanted","Sprache 1:","DEU","durch ungültigen Sprachschlüssel ersetzen, wenn keine deutschen Texte übernommen werden sollen","Replace by an invalid language key if German descriptions are not wanted","Sprache 1:","DEU","durch ungültigen Sprachschlüssel ersetzen, wenn keine deutschen Texte übernommen werden sollen","Replace by an invalid language key if German descriptions are not wanted","Sprache 1:","DEU","durch ungültigen Sprachschlüssel ersetzen, wenn keine deutschen Texte übernommen werden sollen","Replace by an invalid language key if German descriptions are not wanted","Sprache 1:","DEU","durch ungültigen Sprachschlüssel ersetzen, wenn keine deutschen Texte übernommen werden sollen","Replace by an invalid language key if German descriptions are not wanted","Sprache 1:","DEU","durch ungültigen Sprachschlüssel ersetzen, wenn keine deutschen Texte übernommen werden sollen","Replace by an invalid language key if German descriptions are not wanted","Sprache 1:","DEU","durch ungültigen Sprachschlüssel ersetzen, wenn keine deutschen Texte übernommen werden sollen","Replace by an invalid language key if German descriptions are not wanted","Sprache 1:","DEU","durch ungültigen Sprachschlüssel ersetzen, wenn keine deutschen Texte übernommen werden sollen","Replace by an invalid language key if German descriptions are not wanted","Sprache 1:","DEU","durch ungültigen Sprachschlüssel ersetzen, wenn keine deutschen Texte übernommen werden sollen","Replace by an invalid language key if German descriptions are not wanted","Sprache 1:","DEU","durch ungültigen Sprachschlüssel ersetzen, wenn keine deutschen Texte übernommen werden sollen","Replace by an invalid language key if German descriptions are not wanted","Sprache 1:","DEU","durch ungültigen Sprachschlüssel ersetzen, wenn keine deutschen Texte übernommen werden sollen","Replace by an invalid language key if German descriptions are not wanted","Sprache 1:","DEU","durch ungültigen Sprachschlüssel ersetzen, wenn keine deutschen Texte übernommen werden sollen","Replace by an invalid language key if German descriptions are not wanted","Sprache 1:","DEU","durch ungültigen Sprachschlüssel ersetzen, wenn keine deutschen Texte übernommen werden sollen","Replace by an invalid language key if German descriptions are not wanted","Sprache 1:","DEU","durch ungültigen Sprachschlüssel ersetzen, wenn keine deutschen Texte übernommen werden sollen","Replace by an invalid language key if German descriptions are not wanted","Sprache 1:","DEU","durch ungültigen Sprachschlüssel ersetzen, wenn keine deutschen Texte übernommen werden sollen","Replace by an invalid language key if German descriptions are not wanted","Sprache 1:","DEU","durch ungültigen Sprachschlüssel ersetzen, wenn keine deutschen Texte übernommen werden sollen","Replace by an invalid language key if German descriptions are not wanted","Sprache 1:","DEU","durch ungültigen Sprachschlüssel ersetzen, wenn keine deutschen Texte übernommen werden sollen","Replace by an invalid language key if German descriptions are not wanted","Sprache 1:","DEU","durch ungültigen Sprachschlüssel ersetzen, wenn keine deutschen Texte übernommen werden sollen","Replace by an invalid language key if German descriptions are not wanted","Sprache 1:","DEU","durch ungültigen Sprachschlüssel ersetzen, wenn keine deutschen Texte übernommen werden sollen","Replace by an invalid language key if German descriptions are not wanted","Sprache 1:","DEU","durch ungültigen Sprachschlüssel ersetzen, wenn keine deutschen Texte übernommen werden sollen","Replace by an invalid language key if German descriptions are not wanted","Sprache 1:","DEU","durch ungültigen Sprachschlüssel ersetzen, wenn keine deutschen Texte übernommen werden sollen","Replace by an invalid language key if German descriptions are not wanted","Sprache 1:","DEU","durch ungültigen Sprachschlüssel ersetzen, wenn keine deutschen Texte übernommen werden sollen","Replace by an invalid language key if German descriptions are not wanted","Sprache 1:","DEU","durch ungültigen Sprachschlüssel ersetzen, wenn keine deutschen Texte übernommen werden sollen","Replace by an invalid language key if German descriptions are not wanted","Sprache 1:","DEU","durch ungültigen Sprachschlüssel ersetzen, wenn keine deutschen Texte übernommen werden sollen","Replace by an invalid language key if German descriptions are not wanted","Sprache 1:","DEU","durch ungültigen Sprachschlüssel ersetzen, wenn keine deutschen Texte übernommen werden sollen","Replace by an invalid language key if German descriptions are not wanted","Sprache 1:","DEU","durch ungültigen Sprachschlüssel ersetzen, wenn keine deutschen Texte übernommen werden sollen","Replace by an invalid language key if German descriptions are not wanted","Sprache 1:","DEU","durch ungültigen Sprachschlüssel ersetzen, wenn keine deutschen Texte übernommen werden sollen","Replace by an invalid language key if German descriptions are not wanted","Sprache 1:","DEU","durch ungültigen Sprachschlüssel ersetzen, wenn keine deutschen Texte übernommen werden sollen","Replace by an invalid language key if German descriptions are not wanted","Sprache 1:","DEU","durch ungültigen Sprachschlüssel ersetzen, wenn keine deutschen Texte übernommen werden sollen","Replace by an invalid language key if German descriptions are not wanted","Sprache 1:","DEU","durch ungültigen Sprachschlüssel ersetzen, wenn keine deutschen Texte übernommen werden sollen","Replace by an invalid language key if German descriptions are not wanted","Sprache 1:","DEU","durch ungültigen Sprachschlüssel ersetzen, wenn keine deutschen Texte übernommen werden sollen","Replace by an invalid language key if German descriptions are not wanted","Sprache 1:","DEU","durch ungültigen Sprachschlüssel ersetzen, wenn keine deutschen Texte übernommen werden sollen","Replace by an invalid language key if German descriptions are not wanted","Sprache 1:","DEU","durch ungültigen Sprachschlüssel ersetzen, wenn keine deutschen Texte übernommen werden sollen","Replace by an invalid language key if German descriptions are not wanted","Sprache 1:","DEU","durch ungültigen Sprachschlüssel ersetzen, wenn keine deutschen Texte übernommen werden sollen","Replace by an invalid language key if German descriptions are not wanted","Sprache 1:","DEU","durch ungültigen Sprachschlüssel ersetzen, wenn keine deutschen Texte übernommen werden sollen","Replace by an invalid language key if German descriptions are not wanted","Sprache 1:","DEU","durch ungültigen Sprachschlüssel ersetzen, wenn keine deutschen Texte übernommen werden sollen","Replace by an invalid language key if German descriptions are not wanted","Sprache 1:","DEU","durch ungültigen Sprachschlüssel ersetzen, wenn keine deutschen Texte übernommen werden sollen","Replace by an invalid language key if German descriptions are not wanted","Sprache 1:","DEU","durch ungültigen Sprachschlüssel ersetzen, wenn keine deutschen Texte übernommen werden sollen","Replace by an invalid language key if German descriptions are not wanted","Sprache 1:","DEU","durch ungültigen Sprachschlüssel ersetzen, wenn keine deutschen Texte übernommen werden sollen","Replace by an invalid language key if German descriptions are not wanted","Sprache 1:","DEU","durch ungültigen Sprachschlüssel ersetzen, wenn keine deutschen Texte übernommen werden sollen","Replace by an invalid language key if German descriptions are not wanted","Sprache 1:","DEU","durch ungültigen Sprachschlüssel ersetzen, wenn keine deutschen Texte übernommen werden sollen","Replace by an invalid language key if German descriptions are not wanted","Sprache 1:","DEU","durch ungültigen Sprachschlüssel ersetzen, wenn keine deutschen Texte übernommen werden sollen","Replace by an invalid language key if German descriptions are not wanted","Sprache 1:","DEU","durch ungültigen Sprachschlüssel ersetzen, wenn keine deutschen Texte übernommen werden sollen","Replace by an invalid language key if German descriptions are not wanted","Sprache 1:","DEU","durch ungültigen Sprachschlüssel ersetzen, wenn keine deutschen Texte übernommen werden sollen","Replace by an invalid language key if German descriptions are not wanted","Sprache 1:","DEU","durch ungültigen Sprachschlüssel ersetzen, wenn keine deutschen Texte übernommen werden sollen","Replace by an invalid language key if German descriptions are not wanted","Sprache 1:","DEU","durch ungültigen Sprachschlüssel ersetzen, wenn keine deutschen Texte übernommen werden sollen","Replace by an invalid language key if German descriptions are not wanted","Sprache 1:","DEU","durch ungültigen Sprachschlüssel ersetzen, wenn keine deutschen Texte übernommen werden sollen","Replace by an invalid language key if German descriptions are not wanted","Sprache 1:","DEU","durch ungültigen Sprachschlüssel ersetzen, wenn keine deutschen Texte übernommen werden sollen","Replace by an invalid language key if German descriptions are not wanted","Sprache 1:","DEU","durch ungültigen Sprachschlüssel ersetzen, wenn keine deutschen Texte übernommen werden sollen","Replace by an invalid language key if German descriptions are not wanted","Sprache 1:","DEU","durch ungültigen Sprachschlüssel ersetzen, wenn keine deutschen Texte übernommen werden sollen","Replace by an invalid language key if German descriptions are not wanted","Sprache 1:","DEU","durch ungültigen Sprachschlüssel ersetzen, wenn keine deutschen Texte übernommen werden sollen","Replace by an invalid language key if German descriptions are not wanted","Sprache 1:","DEU","durch ungültigen Sprachschlüssel ersetzen, wenn keine deutschen Texte übernommen werden sollen","Replace by an invalid language key if German descriptions are not wanted","Sprache 1:","DEU","durch ungültigen Sprachschlüssel ersetzen, wenn keine deutschen Texte übernommen werden sollen","Replace by an invalid language key if German descriptions are not wanted","Sprache 1:","DEU","durch ungültigen Sprachschlüssel ersetzen, wenn keine deutschen Texte übernommen werden sollen","Replace by an invalid language key if German descriptions are not wanted","Sprache 1:","DEU","durch ungültigen Sprachschlüssel ersetzen, wenn keine deutschen Texte übernommen werden sollen","Replace by an invalid language key if German descriptions are not wanted","Sprache 1:","DEU","durch ungültigen Sprachschlüssel ersetzen, wenn keine deutschen Texte übernommen werden sollen","Replace by an invalid language key if German descriptions are not wanted","Sprache 1:","DEU","durch ungültigen Sprachschlüssel ersetzen, wenn keine deutschen Texte übernommen werden sollen","Replace by an invalid language key if German descriptions are not wanted","Sprache 1:","DEU","durch ungültigen Sprachschlüssel ersetzen, wenn keine deutschen Texte übernommen werden sollen","Replace by an invalid language key if German descriptions are not wanted","Sprache 1:","DEU","durch ungültigen Sprachschlüssel ersetzen, wenn keine deutschen Texte übernommen werden sollen","Replace by an invalid language key if German descriptions are not wanted","Sprache 1:","DEU","durch ungültigen Sprachschlüssel ersetzen, wenn keine deutschen Texte übernommen werden sollen","Replace by an invalid language key if German descriptions are not wanted","Sprache 1:","DEU","durch ungültigen Sprachschlüssel ersetzen, wenn keine deutschen Texte übernommen werden sollen","Replace by an invalid language key if German descriptions are not wanted","Sprache 1:","DEU","durch ungültigen Sprachschlüssel ersetzen, wenn keine deutschen Texte übernommen werden sollen","Replace by an invalid language key if German descriptions are not wanted","Sprache 1:","DEU","durch ungültigen Sprachschlüssel ersetzen, wenn keine deutschen Texte übernommen werden sollen","Replace by an invalid language key if German descriptions are not wanted","Sprache 1:","DEU","durch ungültigen Sprachschlüssel ersetzen, wenn keine deutschen Texte übernommen werden sollen","Replace by an invalid language key if German descriptions are not wanted","Sprache 1:","DEU","durch ungültigen Sprachschlüssel ersetzen, wenn keine deutschen Texte übernommen werden sollen","Replace by an invalid language key if German descriptions are not wanted","Sprache 1:","DEU","durch ungültigen Sprachschlüssel ersetzen, wenn keine deutschen Texte übernommen werden sollen","Replace by an invalid language key if German descriptions are not wanted","Sprache 1:","DEU","durch ungültigen Sprachschlüssel ersetzen, wenn keine deutschen Texte übernommen werden sollen","Replace by an invalid language key if German descriptions are not wanted","Sprache 1:","DEU","durch ungültigen Sprachschlüssel ersetzen, wenn keine deutschen Texte übernommen werden sollen","Replace by an invalid language key if German descriptions are not wanted","Sprache 1:","DEU","durch ungültigen Sprachschlüssel ersetzen, wenn keine deutschen Texte übernommen werden sollen","Replace by an invalid language key if German descriptions are not wanted","Sprache 1:","DEU","durch ungültigen Sprachschlüssel ersetzen, wenn keine deutschen Texte übernommen werden sollen","Replace by an invalid language key if German descriptions are not wanted","Sprache 1:","DEU","durch ungültigen Sprachschlüssel ersetzen, wenn keine deutschen Texte übernommen werden sollen","Replace by an invalid language key if German descriptions are not wanted","Sprache 1:","DEU","durch ungültigen Sprachschlüssel ersetzen, wenn keine deutschen Texte übernommen werden sollen","Replace by an invalid language key if German descriptions are not wanted","Sprache 1:","DEU","durch ungültigen Sprachschlüssel ersetzen, wenn keine deutschen Texte übernommen werden sollen","Replace by an invalid language key if German descriptions are not wanted","Sprache 1:","DEU","durch ungültigen Sprachschlüssel ersetzen, wenn keine deutschen Texte übernommen werden sollen","Replace by an invalid language key if German descriptions are not wanted","Sprache 1:","DEU","durch ungültigen Sprachschlüssel ersetzen, wenn keine deutschen Texte übernommen werden sollen","Replace by an invalid language key if German descriptions are not wanted","Sprache 1:","DEU","durch ungültigen Sprachschlüssel ersetzen, wenn keine deutschen Texte übernommen werden sollen","Replace by an invalid language key if German descriptions are not wanted","Sprache 1:","DEU","durch ungültigen Sprachschlüssel ersetzen, wenn keine deutschen Texte übernommen werden sollen","Replace by an invalid language key if German descriptions are not wanted","Sprache 1:","DEU","durch ungültigen Sprachschlüssel ersetzen, wenn keine deutschen Texte übernommen werden sollen","Replace by an invalid language key if German descriptions are not wanted","Sprache 1:","DEU","durch ungültigen Sprachschlüssel ersetzen, wenn keine deutschen Texte übernommen werden sollen","Replace by an invalid language key if German descriptions are not wanted","Sprache 1:","DEU","durch ungültigen Sprachschlüssel ersetzen, wenn keine deutschen Texte übernommen werden sollen","Replace by an invalid language key if German descriptions are not wanted","Sprache 1:","DEU","durch ungültigen Sprachschlüssel ersetzen, wenn keine deutschen Texte übernommen werden sollen","Replace by an invalid language key if German descriptions are not wanted","Sprache 1:","DEU","durch ungültigen Sprachschlüssel ersetzen, wenn keine deutschen Texte übernommen werden sollen","Replace by an invalid language key if German descriptions are not wanted","Sprache 1:","DEU","durch ungültigen Sprachschlüssel ersetzen, wenn keine deutschen Texte übernommen werden sollen","Replace by an invalid language key if German descriptions are not wanted","Sprache 1:","DEU","durch ungültigen Sprachschlüssel ersetzen, wenn keine deutschen Texte übernommen werden sollen","Replace by an invalid language key if German descriptions are not wanted","Sprache 1:","DEU","durch ungültigen Sprachschlüssel ersetzen, wenn keine deutschen Texte übernommen werden sollen","Replace by an invalid language key if German descriptions are not wanted","Sprache 1:","DEU","durch ungültigen Sprachschlüssel ersetzen, wenn keine deutschen Texte übernommen werden sollen","Replace by an invalid language key if German descriptions are not wanted","Sprache 1:","DEU","durch ungültigen Sprachschlüssel ersetzen, wenn keine deutschen Texte übernommen werden sollen","Replace by an invalid language key if German descriptions are not wanted","Sprache 1:","DEU","durch ungültigen Sprachschlüssel ersetzen, wenn keine deutschen Texte übernommen werden sollen","Replace by an invalid language key if German descriptions are not wanted","Sprache 1:","DEU","durch ungültigen Sprachschlüssel ersetzen, wenn keine deutschen Texte übernommen werden sollen","Replace by an invalid language key if German descriptions are not wanted","Sprache 1:","DEU","durch ungültigen Sprachschlüssel ersetzen, wenn keine deutschen Texte übernommen werden sollen","Replace by an invalid language key if German descriptions are not wanted","Sprache 1:","DEU","durch ungültigen Sprachschlüssel ersetzen, wenn keine deutschen Texte übernommen werden sollen","Replace by an invalid language key if German descriptions are not wanted","Sprache 1:","DEU","durch ungültigen Sprachschlüssel ersetzen, wenn keine deutschen Texte übernommen werden sollen","Replace by an invalid language key if German descriptions are not wanted","Sprache 1:","DEU","durch ungültigen Sprachschlüssel ersetzen, wenn keine deutschen Texte übernommen werden sollen","Replace by an invalid language key if German descriptions are not wanted","Sprache 1:","DEU","durch ungültigen Sprachschlüssel ersetzen, wenn keine deutschen Texte übernommen werden sollen","Replace by an invalid language key if German descriptions are not wanted","Sprache 1:","DEU","durch ungültigen Sprachschlüssel ersetzen, wenn keine deutschen Texte übernommen werden sollen","Replace by an invalid language key if German descriptions are not wanted","Sprache 1:","DEU","durch ungültigen Sprachschlüssel ersetzen, wenn keine deutschen Texte übernommen werden sollen","Replace by an invalid language key if German descriptions are not wanted","Sprache 1:","DEU","durch ungültigen Sprachschlüssel ersetzen, wenn keine deutschen Texte übernommen werden sollen","Replace by an invalid language key if German descriptions are not wanted","Sprache 1:","DEU","durch ungültigen Sprachschlüssel ersetzen, wenn keine deutschen Texte übernommen werden sollen","Replace by an invalid language key if German descriptions are not wanted","Sprache 1:","DEU","durch ungültigen Sprachschlüssel ersetzen, wenn keine deutschen Texte übernommen werden sollen","Replace by an invalid language key if German descriptions are not wanted","Sprache 1:","DEU","durch ungültigen Sprachschlüssel ersetzen, wenn keine deutschen Texte übernommen werden sollen","Replace by an invalid language key if German descriptions are not wanted","Sprache 1:","DEU","durch ungültigen Sprachschlüssel ersetzen, wenn keine deutschen Texte übernommen werden sollen","Replace by an invalid language key if German descriptions are not wanted","Sprache 1:","DEU","durch ungültigen Sprachschlüssel ersetzen, wenn keine deutschen Texte übernommen werden sollen","Replace by an invalid language key if German descriptions are not wanted","Sprache 1:","DEU","durch ungültigen Sprachschlüssel ersetzen, wenn keine deutschen Texte übernommen werden sollen","Replace by an invalid language key if German descriptions are not wanted","Sprache 1:","DEU","durch ungültigen Sprachschlüssel ersetzen, wenn keine deutschen Texte übernommen werden sollen","Replace by an invalid language key if German descriptions are not wanted","Sprache 1:","DEU","durch ungültigen Sprachschlüssel ersetzen, wenn keine deutschen Texte übernommen werden sollen","Replace by an invalid language key if German descriptions are not wanted","Sprache 1:","DEU","durch ungültigen Sprachschlüssel ersetzen, wenn keine deutschen Texte übernommen werden sollen","Replace by an invalid language key if German descriptions are not wanted","Sprache 1:","DEU","durch ungültigen Sprachschlüssel ersetzen, wenn keine deutschen Texte übernommen werden sollen","Replace by an invalid language key if German descriptions are not wanted","Sprache 1:","DEU","durch ungültigen Sprachschlüssel ersetzen, wenn keine deutschen Texte übernommen werden sollen","Replace by an invalid language key if German descriptions are not wanted","Sprache 1:","DEU","durch ungültigen Sprachschlüssel ersetzen, wenn keine deutschen Texte übernommen werden sollen","Replace by an invalid language key if German descriptions are not wanted","Sprache 1:","DEU","durch ungültigen Sprachschlüssel ersetzen, wenn keine deutschen Texte übernommen werden sollen","Replace by an invalid language key if German descriptions are not wanted","Sprache 1:","DEU","durch ungültigen Sprachschlüssel ersetzen, wenn keine deutschen Texte übernommen werden sollen","Replace by an invalid language key if German descriptions are not wanted","Sprache 1:","DEU","durch ungültigen Sprachschlüssel ersetzen, wenn keine deutschen Texte übernommen werden sollen","Replace by an invalid language key if German descriptions are not wanted","Sprache 1:","DEU","durch ungültigen Sprachschlüssel ersetzen, wenn keine deutschen Texte übernommen werden sollen","Replace by an invalid language key if German descriptions are not wanted","Sprache 1:","DEU","durch ungültigen Sprachschlüssel ersetzen, wenn keine deutschen Texte übernommen werden sollen","Replace by an invalid language key if German descriptions are not wanted","Sprache 1:","DEU","durch ungültigen Sprachschlüssel ersetzen, wenn keine deutschen Texte übernommen werden sollen","Replace by an invalid language key if German descriptions are not wanted","Sprache 1:","DEU","durch ungültigen Sprachschlüssel ersetzen, wenn keine deutschen Texte übernommen werden sollen","Replace by an invalid language key if German descriptions are not wanted","Sprache 1:","DEU","durch ungültigen Sprachschlüssel ersetzen, wenn keine deutschen Texte übernommen werden sollen","Replace by an invalid language key if German descriptions are not wanted","Sprache 1:","DEU","durch ungültigen Sprachschlüssel ersetzen, wenn keine deutschen Texte übernommen werden sollen","Replace by an invalid language key if German descriptions are not wanted","Sprache 1:","DEU","durch ungültigen Sprachschlüssel ersetzen, wenn keine deutschen Texte übernommen werden sollen","Replace by an invalid language key if German descriptions are not wanted","Sprache 1:","DEU","durch ungültigen Sprachschlüssel ersetzen, wenn keine deutschen Texte übernommen werden sollen","Replace by an invalid language key if German descriptions are not wanted","Sprache 1:","DEU","durch ungültigen Sprachschlüssel ersetzen, wenn keine deutschen Texte übernommen werden sollen","Replace by an invalid language key if German descriptions are not wanted","Sprache 1:","DEU","durch ungültigen Sprachschlüssel ersetzen, wenn keine deutschen Texte übernommen werden sollen","Replace by an invalid language key if German descriptions are not wanted","Sprache 1:","DEU","durch ungültigen Sprachschlüssel ersetzen, wenn keine deutschen Texte übernommen werden sollen","Replace by an invalid language key if German descriptions are not wanted","Sprache 1:","DEU","durch ungültigen Sprachschlüssel ersetzen, wenn keine deutschen Texte übernommen werden sollen","Replace by an invalid language key if German descriptions are not wanted","Sprache 1:","DEU","durch ungültigen Sprachschlüssel ersetzen, wenn keine deutschen Texte übernommen werden sollen","Replace by an invalid language key if German descriptions are not wanted","Sprache 1:","DEU","durch ungültigen Sprachschlüssel ersetzen, wenn keine deutschen Texte übernommen werden sollen","Replace by an invalid language key if German descriptions are not wanted","Sprache 1:","DEU","durch ungültigen Sprachschlüssel ersetzen, wenn keine deutschen Texte übernommen werden sollen","Replace by an invalid language key if German descriptions are not wanted","Sprache 1:","DEU","durch ungültigen Sprachschlüssel ersetzen, wenn keine deutschen Texte übernommen werden sollen","Replace by an invalid language key if German descriptions are not wanted","Sprache 1:","DEU","durch ungültigen Sprachschlüssel ersetzen, wenn keine deutschen Texte übernommen werden sollen","Replace by an invalid language key if German descriptions are not wanted","Sprache 1:","DEU","durch ungültigen Sprachschlüssel ersetzen, wenn keine deutschen Texte übernommen werden sollen","Replace by an invalid language key if German descriptions are not wanted","Sprache 1:","DEU","durch ungültigen Sprachschlüssel ersetzen, wenn keine deutschen Texte übernommen werden sollen","Replace by an invalid language key if German descriptions are not wanted","Sprache 1:","DEU","durch ungültigen Sprachschlüssel ersetzen, wenn keine deutschen Texte übernommen werden sollen","Replace by an invalid language key if German descriptions are not wanted","Sprache 1:","DEU","durch ungültigen Sprachschlüssel ersetzen, wenn keine deutschen Texte übernommen werden sollen","Replace by an invalid language key if German descriptions are not wanted","Sprache 1:","DEU","durch ungültigen Sprachschlüssel ersetzen, wenn keine deutschen Texte übernommen werden sollen","Replace by an invalid language key if German descriptions are not wanted","Sprache 1:","DEU","durch ungültigen Sprachschlüssel ersetzen, wenn keine deutschen Texte übernommen werden sollen","Replace by an invalid language key if German descriptions are not wanted","Sprache 1:","DEU","durch ungültigen Sprachschlüssel ersetzen, wenn keine deutschen Texte übernommen werden sollen","Replace by an invalid language key if German descriptions are not wanted","Sprache 1:","DEU","durch ungültigen Sprachschlüssel ersetzen, wenn keine deutschen Texte übernommen werden sollen","Replace by an invalid language key if German descriptions are not wanted","Sprache 1:","DEU","durch ungültigen Sprachschlüssel ersetzen, wenn keine deutschen Texte übernommen werden sollen","Replace by an invalid language key if German descriptions are not wanted","Sprache 1:","DEU","durch ungültigen Sprachschlüssel ersetzen, wenn keine deutschen Texte übernommen werden sollen","Replace by an invalid language key if German descriptions are not wanted","Sprache 1:","DEU","durch ungültigen Sprachschlüssel ersetzen, wenn keine deutschen Texte übernommen werden sollen","Replace by an invalid language key if German descriptions are not wanted","Sprache 1:","DEU","durch ungültigen Sprachschlüssel ersetzen, wenn keine deutschen Texte übernommen werden sollen","Replace by an invalid language key if German descriptions are not wanted","Sprache 1:","DEU","durch ungültigen Sprachschlüssel ersetzen, wenn keine deutschen Texte übernommen werden sollen","Replace by an invalid language key if German descriptions are not wanted","Sprache 1:","DEU","durch ungültigen Sprachschlüssel ersetzen, wenn keine deutschen Texte übernommen werden sollen","Replace by an invalid language key if German descriptions are not wanted","Sprache 1:","DEU","durch ungültigen Sprachschlüssel ersetzen, wenn keine deutschen Texte übernommen werden sollen","Replace by an invalid language key if German descriptions are not wanted","Sprache 1:","DEU","durch ungültigen Sprachschlüssel ersetzen, wenn keine deutschen Texte übernommen werden sollen","Replace by an invalid language key if German descriptions are not wanted","Sprache 1:","DEU","durch ungültigen Sprachschlüssel ersetzen, wenn keine deutschen Texte übernommen werden sollen","Replace by an invalid language key if German descriptions are not wanted","Sprache 1:","DEU","durch ungültigen Sprachschlüssel ersetzen, wenn keine deutschen Texte übernommen werden sollen","Replace by an invalid language key if German descriptions are not wanted","Sprache 1:","DEU","durch ungültigen Sprachschlüssel ersetzen, wenn keine deutschen Texte übernommen werden sollen","Replace by an invalid language key if German descriptions are not wanted","Sprache 1:","DEU","durch ungültigen Sprachschlüssel ersetzen, wenn keine deutschen Texte übernommen werden sollen","Replace by an invalid language key if German descriptions are not wanted","Sprache 1:","DEU","durch ungültigen Sprachschlüssel ersetzen, wenn keine deutschen Texte übernommen werden sollen","Replace by an invalid language key if German descriptions are not wanted","Sprache 1:","DEU","durch ungültigen Sprachschlüssel ersetzen, wenn keine deutschen Texte übernommen werden sollen","Replace by an invalid language key if German descriptions are not wanted","Sprache 1:","DEU","durch ungültigen Sprachschlüssel ersetzen, wenn keine deutschen Texte übernommen werden sollen","Replace by an invalid language key if German descriptions are not wanted","Sprache 1:","DEU","durch ungültigen Sprachschlüssel ersetzen, wenn keine deutschen Texte übernommen werden sollen","Replace by an invalid language key if German descriptions are not wanted","Sprache 1:","DEU","durch ungültigen Sprachschlüssel ersetzen, wenn keine deutschen Texte übernommen werden sollen","Replace by an invalid language key if German descriptions are not wanted","Sprache 1:","DEU","durch ungültigen Sprachschlüssel ersetzen, wenn keine deutschen Texte übernommen werden sollen","Replace by an invalid language key if German descriptions are not wanted","Sprache 1:","DEU","durch ungültigen Sprachschlüssel ersetzen, wenn keine deutschen Texte übernommen werden sollen","Replace by an invalid language key if German descriptions are not wanted","Sprache 1:","DEU","durch ungültigen Sprachschlüssel ersetzen, wenn keine deutschen Texte übernommen werden sollen","Replace by an invalid language key if German descriptions are not wanted","Sprache 1:","DEU","durch ungültigen Sprachschlüssel ersetzen, wenn keine deutschen Texte übernommen werden sollen","Replace by an invalid language key if German descriptions are not wanted","Sprache 1:","DEU","durch ungültigen Sprachschlüssel ersetzen, wenn keine deutschen Texte übernommen werden sollen","Replace by an invalid language key if German descriptions are not wanted","Sprache 1:","DEU","durch ungültigen Sprachschlüssel ersetzen, wenn keine deutschen Texte übernommen werden sollen","Replace by an invalid language key if German descriptions are not wanted","Sprache 1:","DEU","durch ungültigen Sprachschlüssel ersetzen, wenn keine deutschen Texte übernommen werden sollen","Replace by an invalid language key if German descriptions are not wanted","Sprache 1:","DEU","durch ungültigen Sprachschlüssel ersetzen, wenn keine deutschen Texte übernommen werden sollen","Replace by an invalid language key if German descriptions are not wanted","Sprache 1:","DEU","durch ungültigen Sprachschlüssel ersetzen, wenn keine deutschen Texte übernommen werden sollen","Replace by an invalid language key if German descriptions are not wanted","Sprache 1:","DEU","durch ungültigen Sprachschlüssel ersetzen, wenn keine deutschen Texte übernommen werden sollen","Replace by an invalid language key if German descriptions are not wanted","Sprache 1:","DEU","durch ungültigen Sprachschlüssel ersetzen, wenn keine deutschen Texte übernommen werden sollen","Replace by an invalid language key if German descriptions are not wanted","Sprache 1:","DEU","durch ungültigen Sprachschlüssel ersetzen, wenn keine deutschen Texte übernommen werden sollen","Replace by an invalid language key if German descriptions are not wanted","Sprache 1:","DEU","durch ungültigen Sprachschlüssel ersetzen, wenn keine deutschen Texte übernommen werden sollen","Replace by an invalid language key if German descriptions are not wanted","Sprache 1:","DEU","durch ungültigen Sprachschlüssel ersetzen, wenn keine deutschen Texte übernommen werden sollen","Replace by an invalid language key if German descriptions are not wanted","Sprache 1:","DEU","durch ungültigen Sprachschlüssel ersetzen, wenn keine deutschen Texte übernommen werden sollen","Replace by an invalid language key if German descriptions are not wanted","Sprache 1:","DEU","durch ungültigen Sprachschlüssel ersetzen, wenn keine deutschen Texte übernommen werden sollen","Replace by an invalid language key if German descriptions are not wanted","Sprache 1:","DEU","durch ungültigen Sprachschlüssel ersetzen, wenn keine deutschen Texte übernommen werden sollen","Replace by an invalid language key if German descriptions are not wanted","Sprache 1:","DEU","durch ungültigen Sprachschlüssel ersetzen, wenn keine deutschen Texte übernommen werden sollen","Replace by an invalid language key if German descriptions are not wanted","Sprache 1:","DEU","durch ungültigen Sprachschlüssel ersetzen, wenn keine deutschen Texte übernommen werden sollen","Replace by an invalid language key if German descriptions are not wanted","Sprache 1:","DEU","durch ungültigen Sprachschlüssel ersetzen, wenn keine deutschen Texte übernommen werden sollen","Replace by an invalid language key if German descriptions are not wanted","Sprache 1:","DEU","durch ungültigen Sprachschlüssel ersetzen, wenn keine deutschen Texte übernommen werden sollen","Replace by an invalid language key if German descriptions are not wanted","Sprache 1:","DEU","durch ungültigen Sprachschlüssel ersetzen, wenn keine deutschen Texte übernommen werden sollen","Replace by an invalid language key if German descriptions are not wanted","Sprache 1:","DEU","durch ungültigen Sprachschlüssel ersetzen, wenn keine deutschen Texte übernommen werden sollen","Replace by an invalid language key if German descriptions are not wanted","Sprache 1:","DEU","durch ungültigen Sprachschlüssel ersetzen, wenn keine deutschen Texte übernommen werden sollen","Replace by an invalid language key if German descriptions are not wanted","Sprache 1:","DEU","durch ungültigen Sprachschlüssel ersetzen, wenn keine deutschen Texte übernommen werden sollen","Replace by an invalid language key if German descriptions are not wanted","Sprache 1:","DEU","durch ungültigen Sprachschlüssel ersetzen, wenn keine deutschen Texte übernommen werden sollen","Replace by an invalid language key if German descriptions are not wanted","Sprache 1:","DEU","durch ungültigen Sprachschlüssel ersetzen, wenn keine deutschen Texte übernommen werden sollen","Replace by an invalid language key if German descriptions are not wanted","Sprache 1:","DEU","durch ungültigen Sprachschlüssel ersetzen, wenn keine deutschen Texte übernommen werden sollen","Replace by an invalid language key if German descriptions are not wanted","Sprache 1:","DEU","durch ungültigen Sprachschlüssel ersetzen, wenn keine deutschen Texte übernommen werden sollen","Replace by an invalid language key if German descriptions are not wanted","Sprache 1:","DEU","durch ungültigen Sprachschlüssel ersetzen, wenn keine deutschen Texte übernommen werden sollen","Replace by an invalid language key if German descriptions are not wanted","Sprache 1:","DEU","durch ungültigen Sprachschlüssel ersetzen, wenn keine deutschen Texte übernommen werden sollen","Replace by an invalid language key if German descriptions are not wanted","Sprache 1:","DEU","durch ungültigen Sprachschlüssel ersetzen, wenn keine deutschen Texte übernommen werden sollen","Replace by an invalid language key if German descriptions are not wanted","Sprache 1:","DEU","durch ungültigen Sprachschlüssel ersetzen, wenn keine deutschen Texte übernommen werden sollen","Replace by an invalid language key if German descriptions are not wanted","Sprache 1:","DEU","durch ungültigen Sprachschlüssel ersetzen, wenn keine deutschen Texte übernommen werden sollen","Replace by an invalid language key if German descriptions are not wanted","Sprache 1:","DEU","durch ungültigen Sprachschlüssel ersetzen, wenn keine deutschen Texte übernommen werden sollen","Replace by an invalid language key if German descriptions are not wanted","Sprache 1:","DEU","durch ungültigen Sprachschlüssel ersetzen, wenn keine deutschen Texte übernommen werden sollen","Replace by an invalid language key if German descriptions are not wanted","Sprache 1:","DEU","durch ungültigen Sprachschlüssel ersetzen, wenn keine deutschen Texte übernommen werden sollen","Replace by an invalid language key if German descriptions are not wanted","Sprache 1:","DEU","durch ungültigen Sprachschlüssel ersetzen, wenn keine deutschen Texte übernommen werden sollen","Replace by an invalid language key if German descriptions are not wanted","Sprache 1:","DEU","durch ungültigen Sprachschlüssel ersetzen, wenn keine deutschen Texte übernommen werden sollen","Replace by an invalid language key if German descriptions are not wanted","Sprache 1:","DEU","durch ungültigen Sprachschlüssel ersetzen, wenn keine deutschen Texte übernommen werden sollen","Replace by an invalid language key if German descriptions are not wanted","Sprache 1:","DEU","durch ungültigen Sprachschlüssel ersetzen, wenn keine deutschen Texte übernommen werden sollen","Replace by an invalid language key if German descriptions are not wanted","Sprache 1:","DEU","durch ungültigen Sprachschlüssel ersetzen, wenn keine deutschen Texte übernommen werden sollen","Replace by an invalid language key if German descriptions are not wanted","Sprache 1:","DEU","durch ungültigen Sprachschlüssel ersetzen, wenn keine deutschen Texte übernommen werden sollen","Replace by an invalid language key if German descriptions are not wanted","Sprache 1:","DEU","durch ungültigen Sprachschlüssel ersetzen, wenn keine deutschen Texte übernommen werden sollen","Replace by an invalid language key if German descriptions are not wanted","Sprache 1:","DEU","durch ungültigen Sprachschlüssel ersetzen, wenn keine deutschen Texte übernommen werden sollen","Replace by an invalid language key if German descriptions are not wanted","Sprache 1:","DEU","durch ungültigen Sprachschlüssel ersetzen, wenn keine deutschen Texte übernommen werden sollen","Replace by an invalid language key if German descriptions are not wanted","Sprache 1:","DEU","durch ungültigen Sprachschlüssel ersetzen, wenn keine deutschen Texte übernommen werden sollen","Replace by an invalid language key if German descriptions are not wanted","Sprache 1:","DEU","durch ungültigen Sprachschlüssel ersetzen, wenn keine deutschen Texte übernommen werden sollen","Replace by an invalid language key if German descriptions are not wanted","Sprache 1:","DEU","durch ungültigen Sprachschlüssel ersetzen, wenn keine deutschen Texte übernommen werden sollen","Replace by an invalid language key if German descriptions are not wanted","Sprache 1:","DEU","durch ungültigen Sprachschlüssel ersetzen, wenn keine deutschen Texte übernommen werden sollen","Replace by an invalid language key if German descriptions are not wanted","Sprache 1:","DEU","durch ungültigen Sprachschlüssel ersetzen, wenn keine deutschen Texte übernommen werden sollen","Replace by an invalid language key if German descriptions are not wanted","Sprache 1:","DEU","durch ungültigen Sprachschlüssel ersetzen, wenn keine deutschen Texte übernommen werden sollen","Replace by an invalid language key if German descriptions are not wanted","Sprache 1:","DEU","durch ungültigen Sprachschlüssel ersetzen, wenn keine deutschen Texte übernommen werden sollen","Replace by an invalid language key if German descriptions are not wanted","Sprache 1:","DEU","durch ungültigen Sprachschlüssel ersetzen, wenn keine deutschen Texte übernommen werden sollen","Replace by an invalid language key if German descriptions are not wanted","Sprache 1:","DEU","durch ungültigen Sprachschlüssel ersetzen, wenn keine deutschen Texte übernommen werden sollen","Replace by an invalid language key if German descriptions are not wanted","Sprache 1:","DEU","durch ungültigen Sprachschlüssel ersetzen, wenn keine deutschen Texte übernommen werden sollen","Replace by an invalid language key if German descriptions are not wanted","Sprache 1:","DEU","durch ungültigen Sprachschlüssel ersetzen, wenn keine deutschen Texte übernommen werden sollen","Replace by an invalid language key if German descriptions are not wanted","Sprache 1:","DEU","durch ungültigen Sprachschlüssel ersetzen, wenn keine deutschen Texte übernommen werden sollen","Replace by an invalid language key if German descriptions are not wanted","Sprache 1:","DEU","durch ungültigen Sprachschlüssel ersetzen, wenn keine deutschen Texte übernommen werden sollen","Replace by an invalid language key if German descriptions are not wanted","Sprache 1:","DEU","durch ungültigen Sprachschlüssel ersetzen, wenn keine deutschen Texte übernommen werden sollen","Replace by an invalid language key if German descriptions are not wanted","Sprache 1:","DEU","durch ungültigen Sprachschlüssel ersetzen, wenn keine deutschen Texte übernommen werden sollen","Replace by an invalid language key if German descriptions are not wanted","Sprache 1:","DEU","durch ungültigen Sprachschlüssel ersetzen, wenn keine deutschen Texte übernommen werden sollen","Replace by an invalid language key if German descriptions are not wanted","Sprache 1:","DEU","durch ungültigen Sprachschlüssel ersetzen, wenn keine deutschen Texte übernommen werden sollen","Replace by an invalid language key if German descriptions are not wanted","Sprache 1:","DEU","durch ungültigen Sprachschlüssel ersetzen, wenn keine deutschen Texte übernommen werden sollen","Replace by an invalid language key if German descriptions are not wanted","Sprache 1:","DEU","durch ungültigen Sprachschlüssel ersetzen, wenn keine deutschen Texte übernommen werden sollen","Replace by an invalid language key if German descriptions are not wanted","Sprache 1:","DEU","durch ungültigen Sprachschlüssel ersetzen, wenn keine deutschen Texte übernommen werden sollen","Replace by an invalid language key if German descriptions are not wanted","Sprache 1:","DEU","durch ungültigen Sprachschlüssel ersetzen, wenn keine deutschen Texte übernommen werden sollen","Replace by an invalid language key if German descriptions are not wanted","Sprache 1:","DEU","durch ungültigen Sprachschlüssel ersetzen, wenn keine deutschen Texte übernommen werden sollen","Replace by an invalid language key if German descriptions are not wanted","Sprache 1:","DEU","durch ungültigen Sprachschlüssel ersetzen, wenn keine deutschen Texte übernommen werden sollen","Replace by an invalid language key if German descriptions are not wanted","Sprache 1:","DEU","durch ungültigen Sprachschlüssel ersetzen, wenn keine deutschen Texte übernommen werden sollen","Replace by an invalid language key if German descriptions are not wanted","Sprache 1:","DEU","durch ungültigen Sprachschlüssel ersetzen, wenn keine deutschen Texte übernommen werden sollen","Replace by an invalid language key if German descriptions are not wanted","Sprache 1:","DEU","durch ungültigen Sprachschlüssel ersetzen, wenn keine deutschen Texte übernommen werden sollen","Replace by an invalid language key if German descriptions are not wanted","Sprache 1:","DEU","durch ungültigen Sprachschlüssel ersetzen, wenn keine deutschen Texte übernommen werden sollen","Replace by an invalid language key if German descriptions are not wanted","Sprache 1:","DEU","durch ungültigen Sprachschlüssel ersetzen, wenn keine deutschen Texte übernommen werden sollen","Replace by an invalid language key if German descriptions are not wanted","Sprache 1:","DEU","durch ungültigen Sprachschlüssel ersetzen, wenn keine deutschen Texte übernommen werden sollen","Replace by an invalid language key if German descriptions are not wanted","Sprache 1:","DEU","durch ungültigen Sprachschlüssel ersetzen, wenn keine deutschen Texte übernommen werden sollen","Replace by an invalid language key if German descriptions are not wanted","Sprache 1:","DEU","durch ungültigen Sprachschlüssel ersetzen, wenn keine deutschen Texte übernommen werden sollen","Replace by an invalid language key if German descriptions are not wanted","Sprache 1:","DEU","durch ungültigen Sprachschlüssel ersetzen, wenn keine deutschen Texte übernommen werden sollen","Replace by an invalid language key if German descriptions are not wanted","Sprache 1:","DEU","durch ungültigen Sprachschlüssel ersetzen, wenn keine deutschen Texte übernommen werden sollen","Replace by an invalid language key if German descriptions are not wanted","Sprache 1:","DEU","durch ungültigen Sprachschlüssel ersetzen, wenn keine deutschen Texte übernommen werden sollen","Replace by an invalid language key if German descriptions are not wanted","Sprache 1:","DEU","durch ungültigen Sprachschlüssel ersetzen, wenn keine deutschen Texte übernommen werden sollen","Replace by an invalid language key if German descriptions are not wanted","Sprache 1:","DEU","durch ungültigen Sprachschlüssel ersetzen, wenn keine deutschen Texte übernommen werden sollen","Replace by an invalid language key if German descriptions are not wanted","Sprache 1:","DEU","durch ungültigen Sprachschlüssel ersetzen, wenn keine deutschen Texte übernommen werden sollen","Replace by an invalid language key if German descriptions are not wanted","Sprache 1:","DEU","durch ungültigen Sprachschlüssel ersetzen, wenn keine deutschen Texte übernommen werden sollen","Replace by an invalid language key if German descriptions are not wanted","Sprache 1:","DEU","durch ungültigen Sprachschlüssel ersetzen, wenn keine deutschen Texte übernommen werden sollen","Replace by an invalid language key if German descriptions are not wanted","Sprache 1:","DEU","durch ungültigen Sprachschlüssel ersetzen, wenn keine deutschen Texte übernommen werden sollen","Replace by an invalid language key if German descriptions are not wanted","Sprache 1:","DEU","durch ungültigen Sprachschlüssel ersetzen, wenn keine deutschen Texte übernommen werden sollen","Replace by an invalid language key if German descriptions are not wanted","Sprache 1:","DEU","durch ungültigen Sprachschlüssel ersetzen, wenn keine deutschen Texte übernommen werden sollen","Replace by an invalid language key if German descriptions are not wanted","Sprache 1:","DEU","durch ungültigen Sprachschlüssel ersetzen, wenn keine deutschen Texte übernommen werden sollen","Replace by an invalid language key if German descriptions are not wanted","Sprache 1:","DEU","durch ungültigen Sprachschlüssel ersetzen, wenn keine deutschen Texte übernommen werden sollen","Replace by an invalid language key if German descriptions are not wanted","Sprache 1:","DEU","durch ungültigen Sprachschlüssel ersetzen, wenn keine deutschen Texte übernommen werden sollen","Replace by an invalid language key if German descriptions are not wanted","Sprache 1:","DEU","durch ungültigen Sprachschlüssel ersetzen, wenn keine deutschen Texte übernommen werden sollen","Replace by an invalid language key if German descriptions are not wanted","Sprache 1:","DEU","durch ungültigen Sprachschlüssel ersetzen, wenn keine deutschen Texte übernommen werden sollen","Replace by an invalid language key if German descriptions are not wanted","Sprache 1:","DEU","durch ungültigen Sprachschlüssel ersetzen, wenn keine deutschen Texte übernommen werden sollen","Replace by an invalid language key if German descriptions are not wanted","Sprache 1:","DEU","durch ungültigen Sprachschlüssel ersetzen, wenn keine deutschen Texte übernommen werden sollen","Replace by an invalid language key if German descriptions are not wanted","Sprache 1:","DEU","durch ungültigen Sprachschlüssel ersetzen, wenn keine deutschen Texte übernommen werden sollen","Replace by an invalid language key if German descriptions are not wanted","Sprache 1:","DEU","durch ungültigen Sprachschlüssel ersetzen, wenn keine deutschen Texte übernommen werden sollen","Replace by an invalid language key if German descriptions are not wanted","Sprache 1:","DEU","durch ungültigen Sprachschlüssel ersetzen, wenn keine deutschen Texte übernommen werden sollen","Replace by an invalid language key if German descriptions are not wanted","Sprache 1:","DEU","durch ungültigen Sprachschlüssel ersetzen, wenn keine deutschen Texte übernommen werden sollen","Replace by an invalid language key if German descriptions are not wanted","Sprache 1:","DEU","durch ungültigen Sprachschlüssel ersetzen, wenn keine deutschen Texte übernommen werden sollen","Replace by an invalid language key if German descriptions are not wanted","Sprache 1:","DEU","durch ungültigen Sprachschlüssel ersetzen, wenn keine deutschen Texte übernommen werden sollen","Replace by an invalid language key if German descriptions are not wanted","Sprache 1:","DEU","durch ungültigen Sprachschlüssel ersetzen, wenn keine deutschen Texte übernommen werden sollen","Replace by an invalid language key if German descriptions are not wanted","Sprache 1:","DEU","durch ungültigen Sprachschlüssel ersetzen, wenn keine deutschen Texte übernommen werden sollen","Replace by an invalid language key if German descriptions are not wanted","Sprache 1:","DEU","durch ungültigen Sprachschlüssel ersetzen, wenn keine deutschen Texte übernommen werden sollen","Replace by an invalid language key if German descriptions are not wanted","Sprache 1:","DEU","durch ungültigen Sprachschlüssel ersetzen, wenn keine deutschen Texte übernommen werden sollen","Replace by an invalid language key if German descriptions are not wanted","Sprache 1:","DEU","durch ungültigen Sprachschlüssel ersetzen, wenn keine deutschen Texte übernommen werden sollen","Replace by an invalid language key if German descriptions are not wanted","Sprache 1:","DEU","durch ungültigen Sprachschlüssel ersetzen, wenn keine deutschen Texte übernommen werden sollen","Replace by an invalid language key if German descriptions are not wanted","Sprache 1:","DEU","durch ungültigen Sprachschlüssel ersetzen, wenn keine deutschen Texte übernommen werden sollen","Replace by an invalid language key if German descriptions are not wanted","Sprache 1:","DEU","durch ungültigen Sprachschlüssel ersetzen, wenn keine deutschen Texte übernommen werden sollen","Replace by an invalid language key if German descriptions are not wanted","Sprache 1:","DEU","durch ungültigen Sprachschlüssel ersetzen, wenn keine deutschen Texte übernommen werden sollen","Replace by an invalid language key if German descriptions are not wanted","Sprache 1:","DEU","durch ungültigen Sprachschlüssel ersetzen, wenn keine deutschen Texte übernommen werden sollen","Replace by an invalid language key if German descriptions are not wanted","Sprache 1:","DEU","durch ungültigen Sprachschlüssel ersetzen, wenn keine deutschen Texte übernommen werden sollen","Replace by an invalid language key if German descriptions are not wanted","Sprache 1:","DEU","durch ungültigen Sprachschlüssel ersetzen, wenn keine deutschen Texte übernommen werden sollen","Replace by an invalid language key if German descriptions are not wanted","Sprache 1:","DEU","durch ungültigen Sprachschlüssel ersetzen, wenn keine deutschen Texte übernommen werden sollen","Replace by an invalid language key if German descriptions are not wanted","Sprache 1:","DEU","durch ungültigen Sprachschlüssel ersetzen, wenn keine deutschen Texte übernommen werden sollen","Replace by an invalid language key if German descriptions are not wanted","Sprache 1:","DEU","durch ungültigen Sprachschlüssel ersetzen, wenn keine deutschen Texte übernommen werden sollen","Replace by an invalid language key if German descriptions are not wanted","Sprache 1:","DEU","durch ungültigen Sprachschlüssel ersetzen, wenn keine deutschen Texte übernommen werden sollen","Replace by an invalid language key if German descriptions are not wanted","Sprache 1:","DEU","durch ungültigen Sprachschlüssel ersetzen, wenn keine deutschen Texte übernommen werden sollen","Replace by an invalid language key if German descriptions are not wanted","Sprache 1:","DEU","durch ungültigen Sprachschlüssel ersetzen, wenn keine deutschen Texte übernommen werden sollen","Replace by an invalid language key if German descriptions are not wanted","Sprache 1:","DEU","durch ungültigen Sprachschlüssel ersetzen, wenn keine deutschen Texte übernommen werden sollen","Replace by an invalid language key if German descriptions are not wanted","Sprache 1:","DEU","durch ungültigen Sprachschlüssel ersetzen, wenn keine deutschen Texte übernommen werden sollen","Replace by an invalid language key if German descriptions are not wanted","Sprache 1:","DEU","durch ungültigen Sprachschlüssel ersetzen, wenn keine deutschen Texte übernommen werden sollen","Replace by an invalid language key if German descriptions are not wanted","Sprache 1:","DEU","durch ungültigen Sprachschlüssel ersetzen, wenn keine deutschen Texte übernommen werden sollen","Replace by an invalid language key if German descriptions are not wanted","Sprache 1:","DEU","durch ungültigen Sprachschlüssel ersetzen, wenn keine deutschen Texte übernommen werden sollen","Replace by an invalid language key if German descriptions are not wanted","Sprache 1:","DEU","durch ungültigen Sprachschlüssel ersetzen, wenn keine deutschen Texte übernommen werden sollen","Replace by an invalid language key if German descriptions are not wanted","Sprache 1:","DEU","durch ungültigen Sprachschlüssel ersetzen, wenn keine deutschen Texte übernommen werden sollen","Replace by an invalid language key if German descriptions are not wanted","Sprache 1:","DEU","durch ungültigen Sprachschlüssel ersetzen, wenn keine deutschen Texte übernommen werden sollen","Replace by an invalid language key if German descriptions are not wanted","Sprache 1:","DEU","durch ungültigen Sprachschlüssel ersetzen, wenn keine deutschen Texte übernommen werden sollen","Replace by an invalid language key if German descriptions are not wanted","Sprache 1:","DEU","durch ungültigen Sprachschlüssel ersetzen, wenn keine deutschen Texte übernommen werden sollen","Replace by an invalid language key if German descriptions are not wanted","Sprache 1:","DEU","durch ungültigen Sprachschlüssel ersetzen, wenn keine deutschen Texte übernommen werden sollen","Replace by an invalid language key if German descriptions are not wanted","Sprache 1:","DEU","durch ungültigen Sprachschlüssel ersetzen, wenn keine deutschen Texte übernommen werden sollen","Replace by an invalid language key if German descriptions are not wanted","Sprache 1:","DEU","durch ungültigen Sprachschlüssel ersetzen, wenn keine deutschen Texte übernommen werden sollen","Replace by an invalid language key if German descriptions are not wanted","Sprache 1:","DEU","durch ungültigen Sprachschlüssel ersetzen, wenn keine deutschen Texte übernommen werden sollen","Replace by an invalid language key if German descriptions are not wanted","Sprache 1:","DEU","durch ungültigen Sprachschlüssel ersetzen, wenn keine deutschen Texte übernommen werden sollen","Replace by an invalid language key if German descriptions are not wanted","Sprache 1:","DEU","durch ungültigen Sprachschlüssel ersetzen, wenn keine deutschen Texte übernommen werden sollen","Replace by an invalid language key if German descriptions are not wanted","Sprache 1:","DEU","durch ungültigen Sprachschlüssel ersetzen, wenn keine deutschen Texte übernommen werden sollen","Replace by an invalid language key if German descriptions are not wanted","Sprache 1:","DEU","durch ungültigen Sprachschlüssel ersetzen, wenn keine deutschen Texte übernommen werden sollen","Replace by an invalid language key if German descriptions are not wanted","Sprache 1:","DEU","durch ungültigen Sprachschlüssel ersetzen, wenn keine deutschen Texte übernommen werden sollen","Replace by an invalid language key if German descriptions are not wanted","Sprache 1:","DEU","durch ungültigen Sprachschlüssel ersetzen, wenn keine deutschen Texte übernommen werden sollen","Replace by an invalid language key if German descriptions are not wanted","Sprache 1:","DEU","durch ungültigen Sprachschlüssel ersetzen, wenn keine deutschen Texte übernommen werden sollen","Replace by an invalid language key if German descriptions are not wanted","Sprache 1:","DEU","durch ungültigen Sprachschlüssel ersetzen, wenn keine deutschen Texte übernommen werden sollen","Replace by an invalid language key if German descriptions are not wanted","Sprache 1:","DEU","durch ungültigen Sprachschlüssel ersetzen, wenn keine deutschen Texte übernommen werden sollen","Replace by an invalid language key if German descriptions are not wanted","Sprache 1:","DEU","durch ungültigen Sprachschlüssel ersetzen, wenn keine deutschen Texte übernommen werden sollen","Replace by an invalid language key if German descriptions are not wanted","Sprache 1:","DEU","durch ungültigen Sprachschlüssel ersetzen, wenn keine deutschen Texte übernommen werden sollen","Replace by an invalid language key if German descriptions are not wanted","Sprache 1:","DEU","durch ungültigen Sprachschlüssel ersetzen, wenn keine deutschen Texte übernommen werden sollen","Replace by an invalid language key if German descriptions are not wanted","Sprache 1:","DEU","durch ungültigen Sprachschlüssel ersetzen, wenn keine deutschen Texte übernommen werden sollen","Replace by an invalid language key if German descriptions are not wanted","Sprache 1:","DEU","durch ungültigen Sprachschlüssel ersetzen, wenn keine deutschen Texte übernommen werden sollen","Replace by an invalid language key if German descriptions are not wanted","Sprache 1:","DEU","durch ungültigen Sprachschlüssel ersetzen, wenn keine deutschen Texte übernommen werden sollen","Replace by an invalid language key if German descriptions are not wanted","Sprache 1:","DEU","durch ungültigen Sprachschlüssel ersetzen, wenn keine deutschen Texte übernommen werden sollen","Replace by an invalid language key if German descriptions are not wanted","Sprache 1:","DEU","durch ungültigen Sprachschlüssel ersetzen, wenn keine deutschen Texte übernommen werden sollen","Replace by an invalid language key if German descriptions are not wanted","Sprache 1:","DEU","durch ungültigen Sprachschlüssel ersetzen, wenn keine deutschen Texte übernommen werden sollen","Replace by an invalid language key if German descriptions are not wanted","Sprache 1:","DEU","durch ungültigen Sprachschlüssel ersetzen, wenn keine deutschen Texte übernommen werden sollen","Replace by an invalid language key if German descriptions are not wanted","Sprache 1:","DEU","durch ungültigen Sprachschlüssel ersetzen, wenn keine deutschen Texte übernommen werden sollen","Replace by an invalid language key if German descriptions are not wanted","Sprache 1:","DEU","durch ungültigen Sprachschlüssel ersetzen, wenn keine deutschen Texte übernommen werden sollen","Replace by an invalid language key if German descriptions are not wanted","Sprache 1:","DEU","durch ungültigen Sprachschlüssel ersetzen, wenn keine deutschen Texte übernommen werden sollen","Replace by an invalid language key if German descriptions are not wanted","Sprache 1:","DEU","durch ungültigen Sprachschlüssel ersetzen, wenn keine deutschen Texte übernommen werden sollen","Replace by an invalid language key if German descriptions are not wanted","Sprache 1:","DEU","durch ungültigen Sprachschlüssel ersetzen, wenn keine deutschen Texte übernommen werden sollen","Replace by an invalid language key if German descriptions are not wanted","Sprache 1:","DEU","durch ungültigen Sprachschlüssel ersetzen, wenn keine deutschen Texte übernommen werden sollen","Replace by an invalid language key if German descriptions are not wanted","Sprache 1:","DEU","durch ungültigen Sprachschlüssel ersetzen, wenn keine deutschen Texte übernommen werden sollen","Replace by an invalid language key if German descriptions are not wanted","Sprache 1:","DEU","durch ungültigen Sprachschlüssel ersetzen, wenn keine deutschen Texte übernommen werden sollen","Replace by an invalid language key if German descriptions are not wanted","Sprache 1:","DEU","durch ungültigen Sprachschlüssel ersetzen, wenn keine deutschen Texte übernommen werden sollen","Replace by an invalid language key if German descriptions are not wanted","Sprache 1:","DEU","durch ungültigen Sprachschlüssel ersetzen, wenn keine deutschen Texte übernommen werden sollen","Replace by an invalid language key if German descriptions are not wanted","Sprache 1:","DEU","durch ungültigen Sprachschlüssel ersetzen, wenn keine deutschen Texte übernommen werden sollen","Replace by an invalid language key if German descriptions are not wanted","Sprache 1:","DEU","durch ungültigen Sprachschlüssel ersetzen, wenn keine deutschen Texte übernommen werden sollen","Replace by an invalid language key if German descriptions are not wanted","Sprache 1:","DEU","durch ungültigen Sprachschlüssel ersetzen, wenn keine deutschen Texte übernommen werden sollen","Replace by an invalid language key if German descriptions are not wanted","Sprache 1:","DEU","durch ungültigen Sprachschlüssel ersetzen, wenn keine deutschen Texte übernommen werden sollen","Replace by an invalid language key if German descriptions are not wanted","Sprache 1:","DEU","durch ungültigen Sprachschlüssel ersetzen, wenn keine deutschen Texte übernommen werden sollen","Replace by an invalid language key if German descriptions are not wanted","Sprache 1:","DEU","durch ungültigen Sprachschlüssel ersetzen, wenn keine deutschen Texte übernommen werden sollen","Replace by an invalid language key if German descriptions are not wanted","Sprache 1:","DEU","durch ungültigen Sprachschlüssel ersetzen, wenn keine deutschen Texte übernommen werden sollen","Replace by an invalid language key if German descriptions are not wanted","Sprache 1:","DEU","durch ungültigen Sprachschlüssel ersetzen, wenn keine deutschen Texte übernommen werden sollen","Replace by an invalid language key if German descriptions are not wanted","Sprache 1:","DEU","durch ungültigen Sprachschlüssel ersetzen, wenn keine deutschen Texte übernommen werden sollen","Replace by an invalid language key if German descriptions are not wanted","Sprache 1:","DEU","durch ungültigen Sprachschlüssel ersetzen, wenn keine deutschen Texte übernommen werden sollen","Replace by an invalid language key if German descriptions are not wanted","Sprache 1:","DEU","durch ungültigen Sprachschlüssel ersetzen, wenn keine deutschen Texte übernommen werden sollen","Replace by an invalid language key if German descriptions are not wanted","Sprache 1:","DEU","durch ungültigen Sprachschlüssel ersetzen, wenn keine deutschen Texte übernommen werden sollen","Replace by an invalid language key if German descriptions are not wanted","Sprache 1:","DEU","durch ungültigen Sprachschlüssel ersetzen, wenn keine deutschen Texte übernommen werden sollen","Replace by an invalid language key if German descriptions are not wanted","Sprache 1:","DEU","durch ungültigen Sprachschlüssel ersetzen, wenn keine deutschen Texte übernommen werden sollen","Replace by an invalid language key if German descriptions are not wanted","Sprache 1:","DEU","durch ungültigen Sprachschlüssel ersetzen, wenn keine deutschen Texte übernommen werden sollen","Replace by an invalid language key if German descriptions are not wanted","Sprache 1:","DEU","durch ungültigen Sprachschlüssel ersetzen, wenn keine deutschen Texte übernommen werden sollen","Replace by an invalid language key if German descriptions are not wanted","Sprache 1:","DEU","durch ungültigen Sprachschlüssel ersetzen, wenn keine deutschen Texte übernommen werden sollen","Replace by an invalid language key if German descriptions are not wanted","Sprache 1:","DEU","durch ungültigen Sprachschlüssel ersetzen, wenn keine deutschen Texte übernommen werden sollen","Replace by an invalid language key if German descriptions are not wanted","Sprache 1:","DEU","durch ungültigen Sprachschlüssel ersetzen, wenn keine deutschen Texte übernommen werden sollen","Replace by an invalid language key if German descriptions are not wanted","Sprache 1:","DEU","durch ungültigen Sprachschlüssel ersetzen, wenn keine deutschen Texte übernommen werden sollen","Replace by an invalid language key if German descriptions are not wanted","Sprache 1:","DEU","durch ungültigen Sprachschlüssel ersetzen, wenn keine deutschen Texte übernommen werden sollen","Replace by an invalid language key if German descriptions are not wanted","Sprache 1:","DEU","durch ungültigen Sprachschlüssel ersetzen, wenn keine deutschen Texte übernommen werden sollen","Replace by an invalid language key if German descriptions are not wanted","Sprache 1:","DEU","durch ungültigen Sprachschlüssel ersetzen, wenn keine deutschen Texte übernommen werden sollen","Replace by an invalid language key if German descriptions are not wanted","Sprache 1:","DEU","durch ungültigen Sprachschlüssel ersetzen, wenn keine deutschen Texte übernommen werden sollen","Replace by an invalid language key if German descriptions are not wanted","Sprache 1:","DEU","durch ungültigen Sprachschlüssel ersetzen, wenn keine deutschen Texte übernommen werden sollen","Replace by an invalid language key if German descriptions are not wanted","Sprache 1:","DEU","durch ungültigen Sprachschlüssel ersetzen, wenn keine deutschen Texte übernommen werden sollen","Replace by an invalid language key if German descriptions are not wanted","Sprache 1:","DEU","durch ungültigen Sprachschlüssel ersetzen, wenn keine deutschen Texte übernommen werden sollen","Replace by an invalid language key if German descriptions are not wanted","Sprache 1:","DEU","durch ungültigen Sprachschlüssel ersetzen, wenn keine deutschen Texte übernommen werden sollen","Replace by an invalid language key if German descriptions are not wanted","Sprache 1:","DEU","durch ungültigen Sprachschlüssel ersetzen, wenn keine deutschen Texte übernommen werden sollen","Replace by an invalid language key if German descriptions are not wanted","Sprache 1:","DEU","durch ungültigen Sprachschlüssel ersetzen, wenn keine deutschen Texte übernommen werden sollen","Replace by an invalid language key if German descriptions are not wanted","Sprache 1:","DEU","durch ungültigen Sprachschlüssel ersetzen, wenn keine deutschen Texte übernommen werden sollen","Replace by an invalid language key if German descriptions are not wanted","Sprache 1:","DEU","durch ungültigen Sprachschlüssel ersetzen, wenn keine deutschen Texte übernommen werden sollen","Replace by an invalid language key if German descriptions are not wanted","Sprache 1:","DEU","durch ungültigen Sprachschlüssel ersetzen, wenn keine deutschen Texte übernommen werden sollen","Replace by an invalid language key if German descriptions are not wanted","Sprache 1:","DEU","durch ungültigen Sprachschlüssel ersetzen, wenn keine deutschen Texte übernommen werden sollen","Replace by an invalid language key if German descriptions are not wanted","Sprache 1:","DEU","durch ungültigen Sprachschlüssel ersetzen, wenn keine deutschen Texte übernommen werden sollen","Replace by an invalid language key if German descriptions are not wanted","Sprache 1:","DEU","durch ungültigen Sprachschlüssel ersetzen, wenn keine deutschen Texte übernommen werden sollen","Replace by an invalid language key if German descriptions are not wanted","Sprache 1:","DEU","durch ungültigen Sprachschlüssel ersetzen, wenn keine deutschen Texte übernommen werden sollen","Replace by an invalid language key if German descriptions are not wanted","Sprache 1:","DEU","durch ungültigen Sprachschlüssel ersetzen, wenn keine deutschen Texte übernommen werden sollen","Replace by an invalid language key if German descriptions are not wanted","Sprache 1:","DEU","durch ungültigen Sprachschlüssel ersetzen, wenn keine deutschen Texte übernommen werden sollen","Replace by an invalid language key if German descriptions are not wanted","Sprache 1:","DEU","durch ungültigen Sprachschlüssel ersetzen, wenn keine deutschen Texte übernommen werden sollen","Replace by an invalid language key if German descriptions are not wanted","Sprache 1:","DEU","durch ungültigen Sprachschlüssel ersetzen, wenn keine deutschen Texte übernommen werden sollen","Replace by an invalid language key if German descriptions are not wanted","Sprache 1:","DEU","durch ungültigen Sprachschlüssel ersetzen, wenn keine deutschen Texte übernommen werden sollen","Replace by an invalid language key if German descriptions are not wanted","Sprache 1:","DEU","durch ungültigen Sprachschlüssel ersetzen, wenn keine deutschen Texte übernommen werden sollen","Replace by an invalid language key if German descriptions are not wanted","Sprache 1:","DEU","durch ungültigen Sprachschlüssel ersetzen, wenn keine deutschen Texte übernommen werden sollen","Replace by an invalid language key if German descriptions are not wanted","Sprache 1:","DEU","durch ungültigen Sprachschlüssel ersetzen, wenn keine deutschen Texte übernommen werden sollen","Replace by an invalid language key if German descriptions are not wanted","Sprache 1:","DEU","durch ungültigen Sprachschlüssel ersetzen, wenn keine deutschen Texte übernommen werden sollen","Replace by an invalid language key if German descriptions are not wanted","Sprache 1:","DEU","durch ungültigen Sprachschlüssel ersetzen, wenn keine deutschen Texte übernommen werden sollen","Replace by an invalid language key if German descriptions are not wanted","Sprache 1:","DEU","durch ungültigen Sprachschlüssel ersetzen, wenn keine deutschen Texte übernommen werden sollen","Replace by an invalid language key if German descriptions are not wanted","Sprache 1:","DEU","durch ungültigen Sprachschlüssel ersetzen, wenn keine deutschen Texte übernommen werden sollen","Replace by an invalid language key if German descriptions are not wanted","Sprache 1:","DEU","durch ungültigen Sprachschlüssel ersetzen, wenn keine deutschen Texte übernommen werden sollen","Replace by an invalid language key if German descriptions are not wanted","Sprache 1:","DEU","durch ungültigen Sprachschlüssel ersetzen, wenn keine deutschen Texte übernommen werden sollen","Replace by an invalid language key if German descriptions are not wanted","Sprache 1:","DEU","durch ungültigen Sprachschlüssel ersetzen, wenn keine deutschen Texte übernommen werden sollen","Replace by an invalid language key if German descriptions are not wanted","Sprache 1:","DEU","durch ungültigen Sprachschlüssel ersetzen, wenn keine deutschen Texte übernommen werden sollen","Replace by an invalid language key if German descriptions are not wanted","Sprache 1:","DEU","durch ungültigen Sprachschlüssel ersetzen, wenn keine deutschen Texte übernommen werden sollen","Replace by an invalid language key if German descriptions are not wanted","Sprache 1:","DEU","durch ungültigen Sprachschlüssel ersetzen, wenn keine deutschen Texte übernommen werden sollen","Replace by an invalid language key if German descriptions are not wanted","Sprache 1:","DEU","durch ungültigen Sprachschlüssel ersetzen, wenn keine deutschen Texte übernommen werden sollen","Replace by an invalid language key if German descriptions are not wanted","Sprache 1:","DEU","durch ungültigen Sprachschlüssel ersetzen, wenn keine deutschen Texte übernommen werden sollen","Replace by an invalid language key if German descriptions are not wanted","Sprache 1:","DEU","durch ungültigen Sprachschlüssel ersetzen, wenn keine deutschen Texte übernommen werden sollen","Replace by an invalid language key if German descriptions are not wanted","Sprache 1:","DEU","durch ungültigen Sprachschlüssel ersetzen, wenn keine deutschen Texte übernommen werden sollen","Replace by an invalid language key if German descriptions are not wanted","Sprache 1:","DEU","durch ungültigen Sprachschlüssel ersetzen, wenn keine deutschen Texte übernommen werden sollen","Replace by an invalid language key if German descriptions are not wanted","Sprache 1:","DEU","durch ungültigen Sprachschlüssel ersetzen, wenn keine deutschen Texte übernommen werden sollen","Replace by an invalid language key if German descriptions are not wanted","Sprache 1:","DEU","durch ungültigen Sprachschlüssel ersetzen, wenn keine deutschen Texte übernommen werden sollen","Replace by an invalid language key if German descriptions are not wanted","Sprache 1:","DEU","durch ungültigen Sprachschlüssel ersetzen, wenn keine deutschen Texte übernommen werden sollen","Replace by an invalid language key if German descriptions are not wanted","Sprache 1:","DEU","durch ungültigen Sprachschlüssel ersetzen, wenn keine deutschen Texte übernommen werden sollen","Replace by an invalid language key if German descriptions are not wanted","Sprache 1:","DEU","durch ungültigen Sprachschlüssel ersetzen, wenn keine deutschen Texte übernommen werden sollen","Replace by an invalid language key if German descriptions are not wanted","Sprache 1:","DEU","durch ungültigen Sprachschlüssel ersetzen, wenn keine deutschen Texte übernommen werden sollen","Replace by an invalid language key if German descriptions are not wanted","Sprache 1:","DEU","durch ungültigen Sprachschlüssel ersetzen, wenn keine deutschen Texte übernommen werden sollen","Replace by an invalid language key if German descriptions are not wanted","Sprache 1:","DEU","durch ungültigen Sprachschlüssel ersetzen, wenn keine deutschen Texte übernommen werden sollen","Replace by an invalid language key if German descriptions are not wanted","Sprache 1:","DEU","durch ungültigen Sprachschlüssel ersetzen, wenn keine deutschen Texte übernommen werden sollen","Replace by an invalid language key if German descriptions are not wanted","Sprache 1:","DEU","durch ungültigen Sprachschlüssel ersetzen, wenn keine deutschen Texte übernommen werden sollen","Replace by an invalid language key if German descriptions are not wanted","Sprache 1:","DEU","durch ungültigen Sprachschlüssel ersetzen, wenn keine deutschen Texte übernommen werden sollen","Replace by an invalid language key if German descriptions are not wanted","Sprache 1:","DEU","durch ungültigen Sprachschlüssel ersetzen, wenn keine deutschen Texte übernommen werden sollen","Replace by an invalid language key if German descriptions are not wanted","Sprache 1:","DEU","durch ungültigen Sprachschlüssel ersetzen, wenn keine deutschen Texte übernommen werden sollen","Replace by an invalid language key if German descriptions are not wanted","Sprache 1:","DEU","durch ungültigen Sprachschlüssel ersetzen, wenn keine deutschen Texte übernommen werden sollen","Replace by an invalid language key if German descriptions are not wanted","Sprache 1:","DEU","durch ungültigen Sprachschlüssel ersetzen, wenn keine deutschen Texte übernommen werden sollen","Replace by an invalid language key if German descriptions are not wanted","Sprache 1:","DEU","durch ungültigen Sprachschlüssel ersetzen, wenn keine deutschen Texte übernommen werden sollen","Replace by an invalid language key if German descriptions are not wanted","Sprache 1:","DEU","durch ungültigen Sprachschlüssel ersetzen, wenn keine deutschen Texte übernommen werden sollen","Replace by an invalid language key if German descriptions are not wanted","Sprache 1:","DEU","durch ungültigen Sprachschlüssel ersetzen, wenn keine deutschen Texte übernommen werden sollen","Replace by an invalid language key if German descriptions are not wanted","Sprache 1:","DEU","durch ungültigen Sprachschlüssel ersetzen, wenn keine deutschen Texte übernommen werden sollen","Replace by an invalid language key if German descriptions are not wanted","Sprache 1:","DEU","durch ungültigen Sprachschlüssel ersetzen, wenn keine deutschen Texte übernommen werden sollen","Replace by an invalid language key if German descriptions are not wanted","Sprache 1:","DEU","durch ungültigen Sprachschlüssel ersetzen, wenn keine deutschen Texte übernommen werden sollen","Replace by an invalid language key if German descriptions are not wanted","Sprache 1:","DEU","durch ungültigen Sprachschlüssel ersetzen, wenn keine deutschen Texte übernommen werden sollen","Replace by an invalid language key if German descriptions are not wanted","Sprache 1:","DEU","durch ungültigen Sprachschlüssel ersetzen, wenn keine deutschen Texte übernommen werden sollen","Replace by an invalid language key if German descriptions are not wanted","Sprache 1:","DEU","durch ungültigen Sprachschlüssel ersetzen, wenn keine deutschen Texte übernommen werden sollen","Replace by an invalid language key if German descriptions are not wanted","Sprache 1:","DEU","durch ungültigen Sprachschlüssel ersetzen, wenn keine deutschen Texte übernommen werden sollen","Replace by an invalid language key if German descriptions are not wanted","Sprache 1:","DEU","durch ungültigen Sprachschlüssel ersetzen, wenn keine deutschen Texte übernommen werden sollen","Replace by an invalid language key if German descriptions are not wanted","Sprache 1:","DEU","durch ungültigen Sprachschlüssel ersetzen, wenn keine deutschen Texte übernommen werden sollen","Replace by an invalid language key if German descriptions are not wanted","Sprache 1:","DEU","durch ungültigen Sprachschlüssel ersetzen, wenn keine deutschen Texte übernommen werden sollen","Replace by an invalid language key if German descriptions are not wanted","Sprache 1:","DEU","durch ungültigen Sprachschlüssel ersetzen, wenn keine deutschen Texte übernommen werden sollen","Replace by an invalid language key if German descriptions are not wanted","Sprache 1:","DEU","durch ungültigen Sprachschlüssel ersetzen, wenn keine deutschen Texte übernommen werden sollen","Replace by an invalid language key if German descriptions are not wanted","Sprache 1:","DEU","durch ungültigen Sprachschlüssel ersetzen, wenn keine deutschen Texte übernommen werden sollen","Replace by an invalid language key if German descriptions are not wanted","Sprache 1:","DEU","durch ungültigen Sprachschlüssel ersetzen, wenn keine deutschen Texte übernommen werden sollen","Replace by an invalid language key if German descriptions are not wanted","Sprache 1:","DEU","durch ungültigen Sprachschlüssel ersetzen, wenn keine deutschen Texte übernommen werden sollen","Replace by an invalid language key if German descriptions are not wanted","Sprache 1:","DEU","durch ungültigen Sprachschlüssel ersetzen, wenn keine deutschen Texte übernommen werden sollen","Replace by an invalid language key if German descriptions are not wanted","Sprache 1:","DEU","durch ungültigen Sprachschlüssel ersetzen, wenn keine deutschen Texte übernommen werden sollen","Replace by an invalid language key if German descriptions are not wanted","Sprache 1:","DEU","durch ungültigen Sprachschlüssel ersetzen, wenn keine deutschen Texte übernommen werden sollen","Replace by an invalid language key if German descriptions are not wanted","Sprache 1:","DEU","durch ungültigen Sprachschlüssel ersetzen, wenn keine deutschen Texte übernommen werden sollen","Replace by an invalid language key if German descriptions are not wanted","Sprache 1:","DEU","durch ungültigen Sprachschlüssel ersetzen, wenn keine deutschen Texte übernommen werden sollen","Replace by an invalid language key if German descriptions are not wanted","Sprache 1:","DEU","durch ungültigen Sprachschlüssel ersetzen, wenn keine deutschen Texte übernommen werden sollen","Replace by an invalid language key if German descriptions are not wanted","Sprache 1:","DEU","durch ungültigen Sprachschlüssel ersetzen, wenn keine deutschen Texte übernommen werden sollen","Replace by an invalid language key if German descriptions are not wanted","Sprache 1:","DEU","durch ungültigen Sprachschlüssel ersetzen, wenn keine deutschen Texte übernommen werden sollen","Replace by an invalid language key if German descriptions are not wanted","Sprache 1:","DEU","durch ungültigen Sprachschlüssel ersetzen, wenn keine deutschen Texte übernommen werden sollen","Replace by an invalid language key if German descriptions are not wanted","Sprache 1:","DEU","durch ungültigen Sprachschlüssel ersetzen, wenn keine deutschen Texte übernommen werden sollen","Replace by an invalid language key if German descriptions are not wanted","Sprache 1:","DEU","durch ungültigen Sprachschlüssel ersetzen, wenn keine deutschen Texte übernommen werden sollen","Replace by an invalid language key if German descriptions are not wanted","Sprache 1:","DEU","durch ungültigen Sprachschlüssel ersetzen, wenn keine deutschen Texte übernommen werden sollen","Replace by an invalid language key if German descriptions are not wanted","Sprache 1:","DEU","durch ungültigen Sprachschlüssel ersetzen, wenn keine deutschen Texte übernommen werden sollen","Replace by an invalid language key if German descriptions are not wanted","Sprache 1:","DEU","durch ungültigen Sprachschlüssel ersetzen, wenn keine deutschen Texte übernommen werden sollen","Replace by an invalid language key if German descriptions are not wanted","Sprache 1:","DEU","durch ungültigen Sprachschlüssel ersetzen, wenn keine deutschen Texte übernommen werden sollen","Replace by an invalid language key if German descriptions are not wanted","Sprache 1:","DEU","durch ungültigen Sprachschlüssel ersetzen, wenn keine deutschen Texte übernommen werden sollen","Replace by an invalid language key if German descriptions are not wanted","Sprache 1:","DEU","durch ungültigen Sprachschlüssel ersetzen, wenn keine deutschen Texte übernommen werden sollen","Replace by an invalid language key if German descriptions are not wanted","Sprache 1:","DEU","durch ungültigen Sprachschlüssel ersetzen, wenn keine deutschen Texte übernommen werden sollen","Replace by an invalid language key if German descriptions are not wanted","Sprache 1:","DEU","durch ungültigen Sprachschlüssel ersetzen, wenn keine deutschen Texte übernommen werden sollen","Replace by an invalid language key if German descriptions are not wanted","Sprache 1:","DEU","durch ungültigen Sprachschlüssel ersetzen, wenn keine deutschen Texte übernommen werden sollen","Replace by an invalid language key if German descriptions are not wanted","Sprache 1:","DEU","durch ungültigen Sprachschlüssel ersetzen, wenn keine deutschen Texte übernommen werden sollen","Replace by an invalid language key if German descriptions are not wanted","Sprache 1:","DEU","durch ungültigen Sprachschlüssel ersetzen, wenn keine deutschen Texte übernommen werden sollen","Replace by an invalid language key if German descriptions are not wanted","Sprache 1:","DEU","durch ungültigen Sprachschlüssel ersetzen, wenn keine deutschen Texte übernommen werden sollen","Replace by an invalid language key if German descriptions are not wanted","Sprache 1:","DEU","durch ungültigen Sprachschlüssel ersetzen, wenn keine deutschen Texte übernommen werden sollen","Replace by an invalid language key if German descriptions are not wanted","Sprache 1:","DEU","durch ungültigen Sprachschlüssel ersetzen, wenn keine deutschen Texte übernommen werden sollen","Replace by an invalid language key if German descriptions are not wanted","Sprache 1:","DEU","durch ungültigen Sprachschlüssel ersetzen, wenn keine deutschen Texte übernommen werden sollen","Replace by an invalid language key if German descriptions are not wanted","Sprache 1:","DEU","durch ungültigen Sprachschlüssel ersetzen, wenn keine deutschen Texte übernommen werden sollen","Replace by an invalid language key if German descriptions are not wanted","Sprache 1:","DEU","durch ungültigen Sprachschlüssel ersetzen, wenn keine deutschen Texte übernommen werden sollen","Replace by an invalid language key if German descriptions are not wanted","Sprache 1:","DEU","durch ungültigen Sprachschlüssel ersetzen, wenn keine deutschen Texte übernommen werden sollen","Replace by an invalid language key if German descriptions are not wanted","Sprache 1:","DEU","durch ungültigen Sprachschlüssel ersetzen, wenn keine deutschen Texte übernommen werden sollen","Replace by an invalid language key if German descriptions are not wanted","Sprache 1:","DEU","durch ungültigen Sprachschlüssel ersetzen, wenn keine deutschen Texte übernommen werden sollen","Replace by an invalid language key if German descriptions are not wanted","Sprache 1:","DEU","durch ungültigen Sprachschlüssel ersetzen, wenn keine deutschen Texte übernommen werden sollen","Replace by an invalid language key if German descriptions are not wanted","Sprache 1:","DEU","durch ungültigen Sprachschlüssel ersetzen, wenn keine deutschen Texte übernommen werden sollen","Replace by an invalid language key if German descriptions are not wanted","Sprache 1:","DEU","durch ungültigen Sprachschlüssel ersetzen, wenn keine deutschen Texte übernommen werden sollen","Replace by an invalid language key if German descriptions are not wanted","Sprache 1:","DEU","durch ungültigen Sprachschlüssel ersetzen, wenn keine deutschen Texte übernommen werden sollen","Replace by an invalid language key if German descriptions are not wanted","Sprache 1:","DEU","durch ungültigen Sprachschlüssel ersetzen, wenn keine deutschen Texte übernommen werden sollen","Replace by an invalid language key if German descriptions are not wanted","Sprache 1:","DEU","durch ungültigen Sprachschlüssel ersetzen, wenn keine deutschen Texte übernommen werden sollen","Replace by an invalid language key if German descriptions are not wanted","Sprache 1:","DEU","durch ungültigen Sprachschlüssel ersetzen, wenn keine deutschen Texte übernommen werden sollen","Replace by an invalid language key if German descriptions are not wanted","Sprache 1:","DEU","durch ungültigen Sprachschlüssel ersetzen, wenn keine deutschen Texte übernommen werden sollen","Replace by an invalid language key if German descriptions are not wanted","Sprache 1:","DEU","durch ungültigen Sprachschlüssel ersetzen, wenn keine deutschen Texte übernommen werden sollen","Replace by an invalid language key if German descriptions are not wanted","Sprache 1:","DEU","durch ungültigen Sprachschlüssel ersetzen, wenn keine deutschen Texte übernommen werden sollen","Replace by an invalid language key if German descriptions are not wanted","Sprache 1:","DEU","durch ungültigen Sprachschlüssel ersetzen, wenn keine deutschen Texte übernommen werden sollen","Replace by an invalid language key if German descriptions are not wanted","Sprache 1:","DEU","durch ungültigen Sprachschlüssel ersetzen, wenn keine deutschen Texte übernommen werden sollen","Replace by an invalid language key if German descriptions are not wanted","Sprache 1:","DEU","durch ungültigen Sprachschlüssel ersetzen, wenn keine deutschen Texte übernommen werden sollen","Replace by an invalid language key if German descriptions are not wanted","Sprache 1:","DEU","durch ungültigen Sprachschlüssel ersetzen, wenn keine deutschen Texte übernommen werden sollen","Replace by an invalid language key if German descriptions are not wanted","Sprache 1:","DEU","durch ungültigen Sprachschlüssel ersetzen, wenn keine deutschen Texte übernommen werden sollen","Replace by an invalid language key if German descriptions are not wanted","Sprache 1:","DEU","durch ungültigen Sprachschlüssel ersetzen, wenn keine deutschen Texte übernommen werden sollen","Replace by an invalid language key if German descriptions are not wanted","Sprache 1:","DEU","durch ungültigen Sprachschlüssel ersetzen, wenn keine deutschen Texte übernommen werden sollen","Replace by an invalid language key if German descriptions are not wanted","Sprache 1:","DEU","durch ungültigen Sprachschlüssel ersetzen, wenn keine deutschen Texte übernommen werden sollen","Replace by an invalid language key if German descriptions are not wanted","Sprache 1:","DEU","durch ungültigen Sprachschlüssel ersetzen, wenn keine deutschen Texte übernommen werden sollen","Replace by an invalid language key if German descriptions are not wanted","Sprache 1:","DEU","durch ungültigen Sprachschlüssel ersetzen, wenn keine deutschen Texte übernommen werden sollen","Replace by an invalid language key if German descriptions are not wanted","Sprache 1:","DEU","durch ungültigen Sprachschlüssel ersetzen, wenn keine deutschen Texte übernommen werden sollen","Replace by an invalid language key if German descriptions are not wanted","Sprache 1:","DEU","durch ungültigen Sprachschlüssel ersetzen, wenn keine deutschen Texte übernommen werden sollen","Replace by an invalid language key if German descriptions are not wanted","Sprache 1:","DEU","durch ungültigen Sprachschlüssel ersetzen, wenn keine deutschen Texte übernommen werden sollen","Replace by an invalid language key if German descriptions are not wanted","Sprache 1:","DEU","durch ungültigen Sprachschlüssel ersetzen, wenn keine deutschen Texte übernommen werden sollen","Replace by an invalid language key if German descriptions are not wanted","Sprache 1:","DEU","durch ungültigen Sprachschlüssel ersetzen, wenn keine deutschen Texte übernommen werden sollen","Replace by an invalid language key if German descriptions are not wanted","Sprache 1:","DEU","durch ungültigen Sprachschlüssel ersetzen, wenn keine deutschen Texte übernommen werden sollen","Replace by an invalid language key if German descriptions are not wanted","Sprache 1:","DEU","durch ungültigen Sprachschlüssel ersetzen, wenn keine deutschen Texte übernommen werden sollen","Replace by an invalid language key if German descriptions are not wanted","Sprache 1:","DEU","durch ungültigen Sprachschlüssel ersetzen, wenn keine deutschen Texte übernommen werden sollen","Replace by an invalid language key if German descriptions are not wanted","Sprache 1:","DEU","durch ungültigen Sprachschlüssel ersetzen, wenn keine deutschen Texte übernommen werden sollen","Replace by an invalid language key if German descriptions are not wanted","Sprache 1:","DEU","durch ungültigen Sprachschlüssel ersetzen, wenn keine deutschen Texte übernommen werden sollen","Replace by an invalid language key if German descriptions are not wanted","Sprache 1:","DEU","durch ungültigen Sprachschlüssel ersetzen, wenn keine deutschen Texte übernommen werden sollen","Replace by an invalid language key if German descriptions are not wanted","Sprache 1:","DEU","durch ungültigen Sprachschlüssel ersetzen, wenn keine deutschen Texte übernommen werden sollen","Replace by an invalid language key if German descriptions are not wanted","Sprache 1:","DEU","durch ungültigen Sprachschlüssel ersetzen, wenn keine deutschen Texte übernommen werden sollen","Replace by an invalid language key if German descriptions are not wanted","Sprache 1:","DEU","durch ungültigen Sprachschlüssel ersetzen, wenn keine deutschen Texte übernommen werden sollen","Replace by an invalid language key if German descriptions are not wanted","Sprache 1:","DEU","durch ungültigen Sprachschlüssel ersetzen, wenn keine deutschen Texte übernommen werden sollen","Replace by an invalid language key if German descriptions are not wanted","Sprache 1:","DEU","durch ungültigen Sprachschlüssel ersetzen, wenn keine deutschen Texte übernommen werden sollen","Replace by an invalid language key if German descriptions are not wanted","Sprache 1:","DEU","durch ungültigen Sprachschlüssel ersetzen, wenn keine deutschen Texte übernommen werden sollen","Replace by an invalid language key if German descriptions are not wanted","Sprache 1:","DEU","durch ungültigen Sprachschlüssel ersetzen, wenn keine deutschen Texte übernommen werden sollen","Replace by an invalid language key if German descriptions are not wanted","Sprache 1:","DEU","durch ungültigen Sprachschlüssel ersetzen, wenn keine deutschen Texte übernommen werden sollen","Replace by an invalid language key if German descriptions are not wanted","Sprache 1:","DEU","durch ungültigen Sprachschlüssel ersetzen, wenn keine deutschen Texte übernommen werden sollen","Replace by an invalid language key if German descriptions are not wanted","Sprache 1:","DEU","durch ungültigen Sprachschlüssel ersetzen, wenn keine deutschen Texte übernommen werden sollen","Replace by an invalid language key if German descriptions are not wanted","Sprache 1:","DEU","durch ungültigen Sprachschlüssel ersetzen, wenn keine deutschen Texte übernommen werden sollen","Replace by an invalid language key if German descriptions are not wanted","Sprache 1:","DEU","durch ungültigen Sprachschlüssel ersetzen, wenn keine deutschen Texte übernommen werden sollen","Replace by an invalid language key if German descriptions are not wanted","Sprache 1:","DEU","durch ungültigen Sprachschlüssel ersetzen, wenn keine deutschen Texte übernommen werden sollen","Replace by an invalid language key if German descriptions are not wanted","Sprache 1:","DEU","durch ungültigen Sprachschlüssel ersetzen, wenn keine deutschen Texte übernommen werden sollen","Replace by an invalid language key if German descriptions are not wanted","Sprache 1:","DEU","durch ungültigen Sprachschlüssel ersetzen, wenn keine deutschen Texte übernommen werden sollen","Replace by an invalid language key if German descriptions are not wanted","Sprache 1:","DEU","durch ungültigen Sprachschlüssel ersetzen, wenn keine deutschen Texte übernommen werden sollen","Replace by an invalid language key if German descriptions are not wanted","Sprache 1:","DEU","durch ungültigen Sprachschlüssel ersetzen, wenn keine deutschen Texte übernommen werden sollen","Replace by an invalid language key if German descriptions are not wanted","Sprache 1:","DEU","durch ungültigen Sprachschlüssel ersetzen, wenn keine deutschen Texte übernommen werden sollen","Replace by an invalid language key if German descriptions are not wanted","Sprache 1:","DEU","durch ungültigen Sprachschlüssel ersetzen, wenn keine deutschen Texte übernommen werden sollen","Replace by an invalid language key if German descriptions are not wanted","Sprache 1:","DEU","durch ungültigen Sprachschlüssel ersetzen, wenn keine deutschen Texte übernommen werden sollen","Replace by an invalid language key if German descriptions are not wanted","Sprache 1:","DEU","durch ungültigen Sprachschlüssel ersetzen, wenn keine deutschen Texte übernommen werden sollen","Replace by an invalid language key if German descriptions are not wanted","Sprache 1:","DEU","durch ungültigen Sprachschlüssel ersetzen, wenn keine deutschen Texte übernommen werden sollen","Replace by an invalid language key if German descriptions are not wanted","Sprache 1:","DEU","durch ungültigen Sprachschlüssel ersetzen, wenn keine deutschen Texte übernommen werden sollen","Replace by an invalid language key if German descriptions are not wanted","Sprache 1:","DEU","durch ungültigen Sprachschlüssel ersetzen, wenn keine deutschen Texte übernommen werden sollen","Replace by an invalid language key if German descriptions are not wanted","Sprache 1:","DEU","durch ungültigen Sprachschlüssel ersetzen, wenn keine deutschen Texte übernommen werden sollen","Replace by an invalid language key if German descriptions are not wanted","Sprache 1:","DEU","durch ungültigen Sprachschlüssel ersetzen, wenn keine deutschen Texte übernommen werden sollen","Replace by an invalid language key if German descriptions are not wanted","Sprache 1:","DEU","durch ungültigen Sprachschlüssel ersetzen, wenn keine deutschen Texte übernommen werden sollen","Replace by an invalid language key if German descriptions are not wanted","Sprache 1:","DEU","durch ungültigen Sprachschlüssel ersetzen, wenn keine deutschen Texte übernommen werden sollen","Replace by an invalid language key if German descriptions are not wanted","Sprache 1:","DEU","durch ungültigen Sprachschlüssel ersetzen, wenn keine deutschen Texte übernommen werden sollen","Replace by an invalid language key if German descriptions are not wanted","Sprache 1:","DEU","durch ungültigen Sprachschlüssel ersetzen, wenn keine deutschen Texte übernommen werden sollen","Replace by an invalid language key if German descriptions are not wanted","Sprache 1:","DEU","durch ungültigen Sprachschlüssel ersetzen, wenn keine deutschen Texte übernommen werden sollen","Replace by an invalid language key if German descriptions are not wanted","Sprache 1:","DEU","durch ungültigen Sprachschlüssel ersetzen, wenn keine deutschen Texte übernommen werden sollen","Replace by an invalid language key if German descriptions are not wanted","Sprache 1:","DEU","durch ungültigen Sprachschlüssel ersetzen, wenn keine deutschen Texte übernommen werden sollen","Replace by an invalid language key if German descriptions are not wanted","Sprache 1:","DEU","durch ungültigen Sprachschlüssel ersetzen, wenn keine deutschen Texte übernommen werden sollen","Replace by an invalid language key if German descriptions are not wanted","Sprache 1:","DEU","durch ungültigen Sprachschlüssel ersetzen, wenn keine deutschen Texte übernommen werden sollen","Replace by an invalid language key if German descriptions are not wanted","Sprache 1:","DEU","durch ungültigen Sprachschlüssel ersetzen, wenn keine deutschen Texte übernommen werden sollen","Replace by an invalid language key if German descriptions are not wanted","Sprache 1:","DEU","durch ungültigen Sprachschlüssel ersetzen, wenn keine deutschen Texte übernommen werden sollen","Replace by an invalid language key if German descriptions are not wanted","Sprache 1:","DEU","durch ungültigen Sprachschlüssel ersetzen, wenn keine deutschen Texte übernommen werden sollen","Replace by an invalid language key if German descriptions are not wanted","Sprache 1:","DEU","durch ungültigen Sprachschlüssel ersetzen, wenn keine deutschen Texte übernommen werden sollen","Replace by an invalid language key if German descriptions are not wanted","Sprache 1:","DEU","durch ungültigen Sprachschlüssel ersetzen, wenn keine deutschen Texte übernommen werden sollen","Replace by an invalid language key if German descriptions are not wanted","Sprache 1:","DEU","durch ungültigen Sprachschlüssel ersetzen, wenn keine deutschen Texte übernommen werden sollen","Replace by an invalid language key if German descriptions are not wanted","Sprache 1:","DEU","durch ungültigen Sprachschlüssel ersetzen, wenn keine deutschen Texte übernommen werden sollen","Replace by an invalid language key if German descriptions are not wanted","Sprache 1:","DEU","durch ungültigen Sprachschlüssel ersetzen, wenn keine deutschen Texte übernommen werden sollen","Replace by an invalid language key if German descriptions are not wanted","Sprache 1:","DEU","durch ungültigen Sprachschlüssel ersetzen, wenn keine deutschen Texte übernommen werden sollen","Replace by an invalid language key if German descriptions are not wanted","Sprache 1:","DEU","durch ungültigen Sprachschlüssel ersetzen, wenn keine deutschen Texte übernommen werden sollen","Replace by an invalid language key if German descriptions are not wanted","Sprache 1:","DEU","durch ungültigen Sprachschlüssel ersetzen, wenn keine deutschen Texte übernommen werden sollen","Replace by an invalid language key if German descriptions are not wanted","Sprache 1:","DEU","durch ungültigen Sprachschlüssel ersetzen, wenn keine deutschen Texte übernommen werden sollen","Replace by an invalid language key if German descriptions are not wanted","Sprache 1:","DEU","durch ungültigen Sprachschlüssel ersetzen, wenn keine deutschen Texte übernommen werden sollen","Replace by an invalid language key if German descriptions are not wanted","Sprache 1:","DEU","durch ungültigen Sprachschlüssel ersetzen, wenn keine deutschen Texte übernommen werden sollen","Replace by an invalid language key if German descriptions are not wanted","Sprache 1:","DEU","durch ungültigen Sprachschlüssel ersetzen, wenn keine deutschen Texte übernommen werden sollen","Replace by an invalid language key if German descriptions are not wanted","Sprache 1:","DEU","durch ungültigen Sprachschlüssel ersetzen, wenn keine deutschen Texte übernommen werden sollen","Replace by an invalid language key if German descriptions are not wanted","Sprache 1:","DEU","durch ungültigen Sprachschlüssel ersetzen, wenn keine deutschen Texte übernommen werden sollen","Replace by an invalid language key if German descriptions are not wanted","Sprache 1:","DEU","durch ungültigen Sprachschlüssel ersetzen, wenn keine deutschen Texte übernommen werden sollen","Replace by an invalid language key if German descriptions are not wanted","Sprache 1:","DEU","durch ungültigen Sprachschlüssel ersetzen, wenn keine deutschen Texte übernommen werden sollen","Replace by an invalid language key if German descriptions are not wanted","Sprache 1:","DEU","durch ungültigen Sprachschlüssel ersetzen, wenn keine deutschen Texte übernommen werden sollen","Replace by an invalid language key if German descriptions are not wanted","Sprache 1:","DEU","durch ungültigen Sprachschlüssel ersetzen, wenn keine deutschen Texte übernommen werden sollen","Replace by an invalid language key if German descriptions are not wanted","Sprache 1:","DEU","durch ungültigen Sprachschlüssel ersetzen, wenn keine deutschen Texte übernommen werden sollen","Replace by an invalid language key if German descriptions are not wanted","Sprache 1:","DEU","durch ungültigen Sprachschlüssel ersetzen, wenn keine deutschen Texte übernommen werden sollen","Replace by an invalid language key if German descriptions are not wanted","Sprache 1:","DEU","durch ungültigen Sprachschlüssel ersetzen, wenn keine deutschen Texte übernommen werden sollen","Replace by an invalid language key if German descriptions are not wanted","Sprache 1:","DEU","durch ungültigen Sprachschlüssel ersetzen, wenn keine deutschen Texte übernommen werden sollen","Replace by an invalid language key if German descriptions are not wanted","Sprache 1:","DEU","durch ungültigen Sprachschlüssel ersetzen, wenn keine deutschen Texte übernommen werden sollen","Replace by an invalid language key if German descriptions are not wanted","Sprache 1:","DEU","durch ungültigen Sprachschlüssel ersetzen, wenn keine deutschen Texte übernommen werden sollen","Replace by an invalid language key if German descriptions are not wanted","Sprache 1:","DEU","durch ungültigen Sprachschlüssel ersetzen, wenn keine deutschen Texte übernommen werden sollen","Replace by an invalid language key if German descriptions are not wanted","Sprache 1:","DEU","durch ungültigen Sprachschlüssel ersetzen, wenn keine deutschen Texte übernommen werden sollen","Replace by an invalid language key if German descriptions are not wanted","Sprache 1:","DEU","durch ungültigen Sprachschlüssel ersetzen, wenn keine deutschen Texte übernommen werden sollen","Replace by an invalid language key if German descriptions are not wanted","Sprache 1:","DEU","durch ungültigen Sprachschlüssel ersetzen, wenn keine deutschen Texte übernommen werden sollen","Replace by an invalid language key if German descriptions are not wanted","Sprache 1:","DEU","durch ungültigen Sprachschlüssel ersetzen, wenn keine deutschen Texte übernommen werden sollen","Replace by an invalid language key if German descriptions are not wanted","Sprache 1:","DEU","durch ungültigen Sprachschlüssel ersetzen, wenn keine deutschen Texte übernommen werden sollen","Replace by an invalid language key if German descriptions are not wanted","Sprache 1:","DEU","durch ungültigen Sprachschlüssel ersetzen, wenn keine deutschen Texte übernommen werden sollen","Replace by an invalid language key if German descriptions are not wanted","Sprache 1:","DEU","durch ungültigen Sprachschlüssel ersetzen, wenn keine deutschen Texte übernommen werden sollen","Replace by an invalid language key if German descriptions are not wanted","Sprache 1:","DEU","durch ungültigen Sprachschlüssel ersetzen, wenn keine deutschen Texte übernommen werden sollen","Replace by an invalid language key if German descriptions are not wanted","Sprache 1:","DEU","durch ungültigen Sprachschlüssel ersetzen, wenn keine deutschen Texte übernommen werden sollen","Replace by an invalid language key if German descriptions are not wanted","Sprache 1:","DEU","durch ungültigen Sprachschlüssel ersetzen, wenn keine deutschen Texte übernommen werden sollen","Replace by an invalid language key if German descriptions are not wanted","Sprache 1:","DEU","durch ungültigen Sprachschlüssel ersetzen, wenn keine deutschen Texte übernommen werden sollen","Replace by an invalid language key if German descriptions are not wanted","Sprache 1:","DEU","durch ungültigen Sprachschlüssel ersetzen, wenn keine deutschen Texte übernommen werden sollen","Replace by an invalid language key if German descriptions are not wanted","Sprache 1:","DEU","durch ungültigen Sprachschlüssel ersetzen, wenn keine deutschen Texte übernommen werden sollen","Replace by an invalid language key if German descriptions are not wanted","Sprache 1:","DEU","durch ungültigen Sprachschlüssel ersetzen, wenn keine deutschen Texte übernommen werden sollen","Replace by an invalid language key if German descriptions are not wanted","Sprache 1:","DEU","durch ungültigen Sprachschlüssel ersetzen, wenn keine deutschen Texte übernommen werden sollen","Replace by an invalid language key if German descriptions are not wanted","Sprache 1:","DEU","durch ungültigen Sprachschlüssel ersetzen, wenn keine deutschen Texte übernommen werden sollen","Replace by an invalid language key if German descriptions are not wanted","Sprache 1:","DEU","durch ungültigen Sprachschlüssel ersetzen, wenn keine deutschen Texte übernommen werden sollen","Replace by an invalid language key if German descriptions are not wanted","Sprache 1:","DEU","durch ungültigen Sprachschlüssel ersetzen, wenn keine deutschen Texte übernommen werden sollen","Replace by an invalid language key if German descriptions are not wanted","Sprache 1:","DEU","durch ungültigen Sprachschlüssel ersetzen, wenn keine deutschen Texte übernommen werden sollen","Replace by an invalid language key if German descriptions are not wanted","Sprache 1:","DEU","durch ungültigen Sprachschlüssel ersetzen, wenn keine deutschen Texte übernommen werden sollen","Replace by an invalid language key if German descriptions are not wanted","Sprache 1:","DEU","durch ungültigen Sprachschlüssel ersetzen, wenn keine deutschen Texte übernommen werden sollen","Replace by an invalid language key if German descriptions are not wanted","Sprache 1:","DEU","durch ungültigen Sprachschlüssel ersetzen, wenn keine deutschen Texte übernommen werden sollen","Replace by an invalid language key if German descriptions are not wanted","Sprache 1:","DEU","durch ungültigen Sprachschlüssel ersetzen, wenn keine deutschen Texte übernommen werden sollen","Replace by an invalid language key if German descriptions are not wanted","Sprache 1:","DEU","durch ungültigen Sprachschlüssel ersetzen, wenn keine deutschen Texte übernommen werden sollen","Replace by an invalid language key if German descriptions are not wanted","Sprache 1:","DEU","durch ungültigen Sprachschlüssel ersetzen, wenn keine deutschen Texte übernommen werden sollen","Replace by an invalid language key if German descriptions are not wanted","Sprache 1:","DEU","durch ungültigen Sprachschlüssel ersetzen, wenn keine deutschen Texte übernommen werden sollen","Replace by an invalid language key if German descriptions are not wanted","Sprache 1:","DEU","durch ungültigen Sprachschlüssel ersetzen, wenn keine deutschen Texte übernommen werden sollen","Replace by an invalid language key if German descriptions are not wanted","Sprache 1:","DEU","durch ungültigen Sprachschlüssel ersetzen, wenn keine deutschen Texte übernommen werden sollen","Replace by an invalid language key if German descriptions are not wanted","Sprache 1:","DEU","durch ungültigen Sprachschlüssel ersetzen, wenn keine deutschen Texte übernommen werden sollen","Replace by an invalid language key if German descriptions are not wanted","Sprache 1:","DEU","durch ungültigen Sprachschlüssel ersetzen, wenn keine deutschen Texte übernommen werden sollen","Replace by an invalid language key if German descriptions are not wanted","Sprache 1:","DEU","durch ungültigen Sprachschlüssel ersetzen, wenn keine deutschen Texte übernommen werden sollen","Replace by an invalid language key if German descriptions are not wanted","Sprache 1:","DEU","durch ungültigen Sprachschlüssel ersetzen, wenn keine deutschen Texte übernommen werden sollen","Replace by an invalid language key if German descriptions are not wanted","Sprache 1:","DEU","durch ungültigen Sprachschlüssel ersetzen, wenn keine deutschen Texte übernommen werden sollen","Replace by an invalid language key if German descriptions are not wanted","Sprache 1:","DEU","durch ungültigen Sprachschlüssel ersetzen, wenn keine deutschen Texte übernommen werden sollen","Replace by an invalid language key if German descriptions are not wanted","Sprache 1:","DEU","durch ungültigen Sprachschlüssel ersetzen, wenn keine deutschen Texte übernommen werden sollen","Replace by an invalid language key if German descriptions are not wanted","Sprache 1:","DEU","durch ungültigen Sprachschlüssel ersetzen, wenn keine deutschen Texte übernommen werden sollen","Replace by an invalid language key if German descriptions are not wanted","Sprache 1:","DEU","durch ungültigen Sprachschlüssel ersetzen, wenn keine deutschen Texte übernommen werden sollen","Replace by an invalid language key if German descriptions are not wanted","Sprache 1:","DEU","durch ungültigen Sprachschlüssel ersetzen, wenn keine deutschen Texte übernommen werden sollen","Replace by an invalid language key if German descriptions are not wanted","Sprache 1:","DEU","durch ungültigen Sprachschlüssel ersetzen, wenn keine deutschen Texte übernommen werden sollen","Replace by an invalid language key if German descriptions are not wanted","Sprache 1:","DEU","durch ungültigen Sprachschlüssel ersetzen, wenn keine deutschen Texte übernommen werden sollen","Replace by an invalid language key if German descriptions are not wanted","Sprache 1:","DEU","durch ungültigen Sprachschlüssel ersetzen, wenn keine deutschen Texte übernommen werden sollen","Replace by an invalid language key if German descriptions are not wanted","Sprache 1:","DEU","durch ungültigen Sprachschlüssel ersetzen, wenn keine deutschen Texte übernommen werden sollen","Replace by an invalid language key if German descriptions are not wanted","Sprache 1:","DEU","durch ungültigen Sprachschlüssel ersetzen, wenn keine deutschen Texte übernommen werden sollen","Replace by an invalid language key if German descriptions are not wanted","Sprache 1:","DEU","durch ungültigen Sprachschlüssel ersetzen, wenn keine deutschen Texte übernommen werden sollen","Replace by an invalid language key if German descriptions are not wanted","Sprache 1:","DEU","durch ungültigen Sprachschlüssel ersetzen, wenn keine deutschen Texte übernommen werden sollen","Replace by an invalid language key if German descriptions are not wanted","Sprache 1:","DEU","durch ungültigen Sprachschlüssel ersetzen, wenn keine deutschen Texte übernommen werden sollen","Replace by an invalid language key if German descriptions are not wanted","Sprache 1:","DEU","durch ungültigen Sprachschlüssel ersetzen, wenn keine deutschen Texte übernommen werden sollen","Replace by an invalid language key if German descriptions are not wanted","Sprache 1:","DEU","durch ungültigen Sprachschlüssel ersetzen, wenn keine deutschen Texte übernommen werden sollen","Replace by an invalid language key if German descriptions are not wanted","Sprache 1:","DEU","durch ungültigen Sprachschlüssel ersetzen, wenn keine deutschen Texte übernommen werden sollen","Replace by an invalid language key if German descriptions are not wanted","Sprache 1:","DEU","durch ungültigen Sprachschlüssel ersetzen, wenn keine deutschen Texte übernommen werden sollen","Replace by an invalid language key if German descriptions are not wanted","Sprache 1:","DEU","durch ungültigen Sprachschlüssel ersetzen, wenn keine deutschen Texte übernommen werden sollen","Replace by an invalid language key if German descriptions are not wanted","Sprache 1:","DEU","durch ungültigen Sprachschlüssel ersetzen, wenn keine deutschen Texte übernommen werden sollen","Replace by an invalid language key if German descriptions are not wanted","Sprache 1:","DEU","durch ungültigen Sprachschlüssel ersetzen, wenn keine deutschen Texte übernommen werden sollen","Replace by an invalid language key if German descriptions are not wanted","Sprache 1:","DEU","durch ungültigen Sprachschlüssel ersetzen, wenn keine deutschen Texte übernommen werden sollen","Replace by an invalid language key if German descriptions are not wanted","Sprache 1:","DEU","durch ungültigen Sprachschlüssel ersetzen, wenn keine deutschen Texte übernommen werden sollen","Replace by an invalid language key if German descriptions are not wanted","Sprache 1:","DEU","durch ungültigen Sprachschlüssel ersetzen, wenn keine deutschen Texte übernommen werden sollen","Replace by an invalid language key if German descriptions are not wanted","Sprache 1:","DEU","durch ungültigen Sprachschlüssel ersetzen, wenn keine deutschen Texte übernommen werden sollen","Replace by an invalid language key if German descriptions are not wanted","Sprache 1:","DEU","durch ungültigen Sprachschlüssel ersetzen, wenn keine deutschen Texte übernommen werden sollen","Replace by an invalid language key if German descriptions are not wanted","Sprache 1:","DEU","durch ungültigen Sprachschlüssel ersetzen, wenn keine deutschen Texte übernommen werden sollen","Replace by an invalid language key if German descriptions are not wanted","Sprache 1:","DEU","durch ungültigen Sprachschlüssel ersetzen, wenn keine deutschen Texte übernommen werden sollen","Replace by an invalid language key if German descriptions are not wanted","Sprache 1:","DEU","durch ungültigen Sprachschlüssel ersetzen, wenn keine deutschen Texte übernommen werden sollen","Replace by an invalid language key if German descriptions are not wanted","Sprache 1:","DEU","durch ungültigen Sprachschlüssel ersetzen, wenn keine deutschen Texte übernommen werden sollen","Replace by an invalid language key if German descriptions are not wanted","Sprache 1:","DEU","durch ungültigen Sprachschlüssel ersetzen, wenn keine deutschen Texte übernommen werden sollen","Replace by an invalid language key if German descriptions are not wanted","Sprache 1:","DEU","durch ungültigen Sprachschlüssel ersetzen, wenn keine deutschen Texte übernommen werden sollen","Replace by an invalid language key if German descriptions are not wanted","Sprache 1:","DEU","durch ungültigen Sprachschlüssel ersetzen, wenn keine deutschen Texte übernommen werden sollen","Replace by an invalid language key if German descriptions are not wanted","Sprache 1:","DEU","durch ungültigen Sprachschlüssel ersetzen, wenn keine deutschen Texte übernommen werden sollen","Replace by an invalid language key if German descriptions are not wanted","Sprache 1:","DEU","durch ungültigen Sprachschlüssel ersetzen, wenn keine deutschen Texte übernommen werden sollen","Replace by an invalid language key if German descriptions are not wanted","Sprache 1:","DEU","durch ungültigen Sprachschlüssel ersetzen, wenn keine deutschen Texte übernommen werden sollen","Replace by an invalid language key if German descriptions are not wanted","Sprache 1:","DEU","durch ungültigen Sprachschlüssel ersetzen, wenn keine deutschen Texte übernommen werden sollen","Replace by an invalid language key if German descriptions are not wanted","Sprache 1:","DEU","durch ungültigen Sprachschlüssel ersetzen, wenn keine deutschen Texte übernommen werden sollen","Replace by an invalid language key if German descriptions are not wanted","Sprache 1:","DEU","durch ungültigen Sprachschlüssel ersetzen, wenn keine deutschen Texte übernommen werden sollen","Replace by an invalid language key if German descriptions are not wanted","Sprache 1:","DEU","durch ungültigen Sprachschlüssel ersetzen, wenn keine deutschen Texte übernommen werden sollen","Replace by an invalid language key if German descriptions are not wanted","Sprache 1:","DEU","durch ungültigen Sprachschlüssel ersetzen, wenn keine deutschen Texte übernommen werden sollen","Replace by an invalid language key if German descriptions are not wanted","Sprache 1:","DEU","durch ungültigen Sprachschlüssel ersetzen, wenn keine deutschen Texte übernommen werden sollen","Replace by an invalid language key if German descriptions are not wanted","Sprache 1:","DEU","durch ungültigen Sprachschlüssel ersetzen, wenn keine deutschen Texte übernommen werden sollen","Replace by an invalid language key if German descriptions are not wanted","Sprache 1:","DEU","durch ungültigen Sprachschlüssel ersetzen, wenn keine deutschen Texte übernommen werden sollen","Replace by an invalid language key if German descriptions are not wanted","Sprache 1:","DEU","durch ungültigen Sprachschlüssel ersetzen, wenn keine deutschen Texte übernommen werden sollen","Replace by an invalid language key if German descriptions are not wanted","Sprache 1:","DEU","durch ungültigen Sprachschlüssel ersetzen, wenn keine deutschen Texte übernommen werden sollen","Replace by an invalid language key if German descriptions are not wanted","Sprache 1:","DEU","durch ungültigen Sprachschlüssel ersetzen, wenn keine deutschen Texte übernommen werden sollen","Replace by an invalid language key if German descriptions are not wanted","Sprache 1:","DEU","durch ungültigen Sprachschlüssel ersetzen, wenn keine deutschen Texte übernommen werden sollen","Replace by an invalid language key if German descriptions are not wanted","Sprache 1:","DEU","durch ungültigen Sprachschlüssel ersetzen, wenn keine deutschen Texte übernommen werden sollen","Replace by an invalid language key if German descriptions are not wanted","Sprache 1:","DEU","durch ungültigen Sprachschlüssel ersetzen, wenn keine deutschen Texte übernommen werden sollen","Replace by an invalid language key if German descriptions are not wanted","Sprache 1:","DEU","durch ungültigen Sprachschlüssel ersetzen, wenn keine deutschen Texte übernommen werden sollen","Replace by an invalid language key if German descriptions are not wanted","Sprache 1:","DEU","durch ungültigen Sprachschlüssel ersetzen, wenn keine deutschen Texte übernommen werden sollen","Replace by an invalid language key if German descriptions are not wanted","Sprache 1:","DEU","durch ungültigen Sprachschlüssel ersetzen, wenn keine deutschen Texte übernommen werden sollen","Replace by an invalid language key if German descriptions are not wanted","Sprache 1:","DEU","durch ungültigen Sprachschlüssel ersetzen, wenn keine deutschen Texte übernommen werden sollen","Replace by an invalid language key if German descriptions are not wanted","Sprache 1:","DEU","durch ungültigen Sprachschlüssel ersetzen, wenn keine deutschen Texte übernommen werden sollen","Replace by an invalid language key if German descriptions are not wanted","Sprache 1:","DEU","durch ungültigen Sprachschlüssel ersetzen, wenn keine deutschen Texte übernommen werden sollen","Replace by an invalid language key if German descriptions are not wanted","Sprache 1:","DEU","durch ungültigen Sprachschlüssel ersetzen, wenn keine deutschen Texte übernommen werden sollen","Replace by an invalid language key if German descriptions are not wanted","Sprache 1:","DEU","durch ungültigen Sprachschlüssel ersetzen, wenn keine deutschen Texte übernommen werden sollen","Replace by an invalid language key if German descriptions are not wanted","Sprache 1:","DEU","durch ungültigen Sprachschlüssel ersetzen, wenn keine deutschen Texte übernommen werden sollen","Replace by an invalid language key if German descriptions are not wanted","Sprache 1:","DEU","durch ungültigen Sprachschlüssel ersetzen, wenn keine deutschen Texte übernommen werden sollen","Replace by an invalid language key if German descriptions are not wanted","Sprache 1:","DEU","durch ungültigen Sprachschlüssel ersetzen, wenn keine deutschen Texte übernommen werden sollen","Replace by an invalid language key if German descriptions are not wanted","Sprache 1:","DEU","durch ungültigen Sprachschlüssel ersetzen, wenn keine deutschen Texte übernommen werden sollen","Replace by an invalid language key if German descriptions are not wanted","Sprache 1:","DEU","durch ungültigen Sprachschlüssel ersetzen, wenn keine deutschen Texte übernommen werden sollen","Replace by an invalid language key if German descriptions are not wanted","Sprache 1:","DEU","durch ungültigen Sprachschlüssel ersetzen, wenn keine deutschen Texte übernommen werden sollen","Replace by an invalid language key if German descriptions are not wanted","Sprache 1:","DEU","durch ungültigen Sprachschlüssel ersetzen, wenn keine deutschen Texte übernommen werden sollen","Replace by an invalid language key if German descriptions are not wanted","Sprache 1:","DEU","durch ungültigen Sprachschlüssel ersetzen, wenn keine deutschen Texte übernommen werden sollen","Replace by an invalid language key if German descriptions are not wanted","Sprache 1:","DEU","durch ungültigen Sprachschlüssel ersetzen, wenn keine deutschen Texte übernommen werden sollen","Replace by an invalid language key if German descriptions are not wanted","Sprache 1:","DEU","durch ungültigen Sprachschlüssel ersetzen, wenn keine deutschen Texte übernommen werden sollen","Replace by an invalid language key if German descriptions are not wanted","Sprache 1:","DEU","durch ungültigen Sprachschlüssel ersetzen, wenn keine deutschen Texte übernommen werden sollen","Replace by an invalid language key if German descriptions are not wanted","Sprache 1:","DEU","durch ungültigen Sprachschlüssel ersetzen, wenn keine deutschen Texte übernommen werden sollen","Replace by an invalid language key if German descriptions are not wanted","Sprache 1:","DEU","durch ungültigen Sprachschlüssel ersetzen, wenn keine deutschen Texte übernommen werden sollen","Replace by an invalid language key if German descriptions are not wanted","Sprache 1:","DEU","durch ungültigen Sprachschlüssel ersetzen, wenn keine deutschen Texte übernommen werden sollen","Replace by an invalid language key if German descriptions are not wanted","Sprache 1:","DEU","durch ungültigen Sprachschlüssel ersetzen, wenn keine deutschen Texte übernommen werden sollen","Replace by an invalid language key if German descriptions are not wanted","Sprache 1:","DEU","durch ungültigen Sprachschlüssel ersetzen, wenn keine deutschen Texte übernommen werden sollen","Replace by an invalid language key if German descriptions are not wanted","Sprache 1:","DEU","durch ungültigen Sprachschlüssel ersetzen, wenn keine deutschen Texte übernommen werden sollen","Replace by an invalid language key if German descriptions are not wanted","Sprache 1:","DEU","durch ungültigen Sprachschlüssel ersetzen, wenn keine deutschen Texte übernommen werden sollen","Replace by an invalid language key if German descriptions are not wanted","Sprache 1:","DEU","durch ungültigen Sprachschlüssel ersetzen, wenn keine deutschen Texte übernommen werden sollen","Replace by an invalid language key if German descriptions are not wanted","Sprache 1:","DEU","durch ungültigen Sprachschlüssel ersetzen, wenn keine deutschen Texte übernommen werden sollen","Replace by an invalid language key if German descriptions are not wanted","Sprache 1:","DEU","durch ungültigen Sprachschlüssel ersetzen, wenn keine deutschen Texte übernommen werden sollen","Replace by an invalid language key if German descriptions are not wanted","Sprache 1:","DEU","durch ungültigen Sprachschlüssel ersetzen, wenn keine deutschen Texte übernommen werden sollen","Replace by an invalid language key if German descriptions are not wanted","Sprache 1:","DEU","durch ungültigen Sprachschlüssel ersetzen, wenn keine deutschen Texte übernommen werden sollen","Replace by an invalid language key if German descriptions are not wanted","Sprache 1:","DEU","durch ungültigen Sprachschlüssel ersetzen, wenn keine deutschen Texte übernommen werden sollen","Replace by an invalid language key if German descriptions are not wanted","Sprache 1:","DEU","durch ungültigen Sprachschlüssel ersetzen, wenn keine deutschen Texte übernommen werden sollen","Replace by an invalid language key if German descriptions are not wanted","Sprache 1:","DEU","durch ungültigen Sprachschlüssel ersetzen, wenn keine deutschen Texte übernommen werden sollen","Replace by an invalid language key if German descriptions are not wanted","Sprache 1:","DEU","durch ungültigen Sprachschlüssel ersetzen, wenn keine deutschen Texte übernommen werden sollen","Replace by an invalid language key if German descriptions are not wanted","Sprache 1:","DEU","durch ungültigen Sprachschlüssel ersetzen, wenn keine deutschen Texte übernommen werden sollen","Replace by an invalid language key if German descriptions are not wanted","Sprache 1:","DEU","durch ungültigen Sprachschlüssel ersetzen, wenn keine deutschen Texte übernommen werden sollen","Replace by an invalid language key if German descriptions are not wanted","Sprache 1:","DEU","durch ungültigen Sprachschlüssel ersetzen, wenn keine deutschen Texte übernommen werden sollen","Replace by an invalid language key if German descriptions are not wanted","Sprache 1:","DEU","durch ungültigen Sprachschlüssel ersetzen, wenn keine deutschen Texte übernommen werden sollen","Replace by an invalid language key if German descriptions are not wanted","Sprache 1:","DEU","durch ungültigen Sprachschlüssel ersetzen, wenn keine deutschen Texte übernommen werden sollen","Replace by an invalid language key if German descriptions are not wanted","Sprache 1:","DEU","durch ungültigen Sprachschlüssel ersetzen, wenn keine deutschen Texte übernommen werden sollen","Replace by an invalid language key if German descriptions are not wanted","Sprache 1:","DEU","durch ungültigen Sprachschlüssel ersetzen, wenn keine deutschen Texte übernommen werden sollen","Replace by an invalid language key if German descriptions are not wanted","Sprache 1:","DEU","durch ungültigen Sprachschlüssel ersetzen, wenn keine deutschen Texte übernommen werden sollen","Replace by an invalid language key if German descriptions are not wanted","Sprache 1:","DEU","durch ungültigen Sprachschlüssel ersetzen, wenn keine deutschen Texte übernommen werden sollen","Replace by an invalid language key if German descriptions are not wanted","Sprache 1:","DEU","durch ungültigen Sprachschlüssel ersetzen, wenn keine deutschen Texte übernommen werden sollen","Replace by an invalid language key if German descriptions are not wanted","Sprache 1:","DEU","durch ungültigen Sprachschlüssel ersetzen, wenn keine deutschen Texte übernommen werden sollen","Replace by an invalid language key if German descriptions are not wanted","Sprache 1:","DEU","durch ungültigen Sprachschlüssel ersetzen, wenn keine deutschen Texte übernommen werden sollen","Replace by an invalid language key if German descriptions are not wanted","Sprache 1:","DEU","durch ungültigen Sprachschlüssel ersetzen, wenn keine deutschen Texte übernommen werden sollen","Replace by an invalid language key if German descriptions are not wanted","Sprache 1:","DEU","durch ungültigen Sprachschlüssel ersetzen, wenn keine deutschen Texte übernommen werden sollen","Replace by an invalid language key if German descriptions are not wanted","Sprache 1:","DEU","durch ungültigen Sprachschlüssel ersetzen, wenn keine deutschen Texte übernommen werden sollen","Replace by an invalid language key if German descriptions are not wanted","Sprache 1:","DEU","durch ungültigen Sprachschlüssel ersetzen, wenn keine deutschen Texte übernommen werden sollen","Replace by an invalid language key if German descriptions are not wanted","Sprache 1:","DEU","durch ungültigen Sprachschlüssel ersetzen, wenn keine deutschen Texte übernommen werden sollen","Replace by an invalid language key if German descriptions are not wanted","Sprache 1:","DEU","durch ungültigen Sprachschlüssel ersetzen, wenn keine deutschen Texte übernommen werden sollen","Replace by an invalid language key if German descriptions are not wanted","Sprache 1:","DEU","durch ungültigen Sprachschlüssel ersetzen, wenn keine deutschen Texte übernommen werden sollen","Replace by an invalid language key if German descriptions are not wanted","Sprache 1:","DEU","durch ungültigen Sprachschlüssel ersetzen, wenn keine deutschen Texte übernommen werden sollen","Replace by an invalid language key if German descriptions are not wanted","Sprache 1:","DEU","durch ungültigen Sprachschlüssel ersetzen, wenn keine deutschen Texte übernommen werden sollen","Replace by an invalid language key if German descriptions are not wanted","Sprache 1:","DEU","durch ungültigen Sprachschlüssel ersetzen, wenn keine deutschen Texte übernommen werden sollen","Replace by an invalid language key if German descriptions are not wanted","Sprache 1:","DEU","durch ungültigen Sprachschlüssel ersetzen, wenn keine deutschen Texte übernommen werden sollen","Replace by an invalid language key if German descriptions are not wanted","Sprache 1:","DEU","durch ungültigen Sprachschlüssel ersetzen, wenn keine deutschen Texte übernommen werden sollen","Replace by an invalid language key if German descriptions are not wanted","Sprache 1:","DEU","durch ungültigen Sprachschlüssel ersetzen, wenn keine deutschen Texte übernommen werden sollen","Replace by an invalid language key if German descriptions are not wanted","Sprache 1:","DEU","durch ungültigen Sprachschlüssel ersetzen, wenn keine deutschen Texte übernommen werden sollen","Replace by an invalid language key if German descriptions are not wanted","Sprache 1:","DEU","durch ungültigen Sprachschlüssel ersetzen, wenn keine deutschen Texte übernommen werden sollen","Replace by an invalid language key if German descriptions are not wanted","Sprache 1:","DEU","durch ungültigen Sprachschlüssel ersetzen, wenn keine deutschen Texte übernommen werden sollen","Replace by an invalid language key if German descriptions are not wanted","Sprache 1:","DEU","durch ungültigen Sprachschlüssel ersetzen, wenn keine deutschen Texte übernommen werden sollen","Replace by an invalid language key if German descriptions are not wanted","Sprache 1:","DEU","durch ungültigen Sprachschlüssel ersetzen, wenn keine deutschen Texte übernommen werden sollen","Replace by an invalid language key if German descriptions are not wanted","Sprache 1:","DEU","durch ungültigen Sprachschlüssel ersetzen, wenn keine deutschen Texte übernommen werden sollen","Replace by an invalid language key if German descriptions are not wanted","Sprache 1:","DEU","durch ungültigen Sprachschlüssel ersetzen, wenn keine deutschen Texte übernommen werden sollen","Replace by an invalid language key if German descriptions are not wanted","Sprache 1:","DEU","durch ungültigen Sprachschlüssel ersetzen, wenn keine deutschen Texte übernommen werden sollen","Replace by an invalid language key if German descriptions are not wanted","Sprache 1:","DEU","durch ungültigen Sprachschlüssel ersetzen, wenn keine deutschen Texte übernommen werden sollen","Replace by an invalid language key if German descriptions are not wanted","Sprache 1:","DEU","durch ungültigen Sprachschlüssel ersetzen, wenn keine deutschen Texte übernommen werden sollen","Replace by an invalid language key if German descriptions are not wanted","Sprache 1:","DEU","durch ungültigen Sprachschlüssel ersetzen, wenn keine deutschen Texte übernommen werden sollen","Replace by an invalid language key if German descriptions are not wanted","Sprache 1:","DEU","durch ungültigen Sprachschlüssel ersetzen, wenn keine deutschen Texte übernommen werden sollen","Replace by an invalid language key if German descriptions are not wanted","Sprache 1:","DEU","durch ungültigen Sprachschlüssel ersetzen, wenn keine deutschen Texte übernommen werden sollen","Replace by an invalid language key if German descriptions are not wanted","Sprache 1:","DEU","durch ungültigen Sprachschlüssel ersetzen, wenn keine deutschen Texte übernommen werden sollen","Replace by an invalid language key if German descriptions are not wanted","Sprache 1:","DEU","durch ungültigen Sprachschlüssel ersetzen, wenn keine deutschen Texte übernommen werden sollen","Replace by an invalid language key if German descriptions are not wanted","Sprache 1:","DEU","durch ungültigen Sprachschlüssel ersetzen, wenn keine deutschen Texte übernommen werden sollen","Replace by an invalid language key if German descriptions are not wanted","Sprache 1:","DEU","durch ungültigen Sprachschlüssel ersetzen, wenn keine deutschen Texte übernommen werden sollen","Replace by an invalid language key if German descriptions are not wanted","Sprache 1:","DEU","durch ungültigen Sprachschlüssel ersetzen, wenn keine deutschen Texte übernommen werden sollen","Replace by an invalid language key if German descriptions are not wanted","Sprache 1:","DEU","durch ungültigen Sprachschlüssel ersetzen, wenn keine deutschen Texte übernommen werden sollen","Replace by an invalid language key if German descriptions are not wanted","Sprache 1:","DEU","durch ungültigen Sprachschlüssel ersetzen, wenn keine deutschen Texte übernommen werden sollen","Replace by an invalid language key if German descriptions are not wanted","Sprache 1:","DEU","durch ungültigen Sprachschlüssel ersetzen, wenn keine deutschen Texte übernommen werden sollen","Replace by an invalid language key if German descriptions are not wanted","Sprache 1:","DEU","durch ungültigen Sprachschlüssel ersetzen, wenn keine deutschen Texte übernommen werden sollen","Replace by an invalid language key if German descriptions are not wanted","Sprache 1:","DEU","durch ungültigen Sprachschlüssel ersetzen, wenn keine deutschen Texte übernommen werden sollen","Replace by an invalid language key if German descriptions are not wanted","Sprache 1:","DEU","durch ungültigen Sprachschlüssel ersetzen, wenn keine deutschen Texte übernommen werden sollen","Replace by an invalid language key if German descriptions are not wanted","Sprache 1:","DEU","durch ungültigen Sprachschlüssel ersetzen, wenn keine deutschen Texte übernommen werden sollen","Replace by an invalid language key if German descriptions are not wanted","Sprache 1:","DEU","durch ungültigen Sprachschlüssel ersetzen, wenn keine deutschen Texte übernommen werden sollen","Replace by an invalid language key if German descriptions are not wanted","Sprache 1:","DEU","durch ungültigen Sprachschlüssel ersetzen, wenn keine deutschen Texte übernommen werden sollen","Replace by an invalid language key if German descriptions are not wanted","Sprache 1:","DEU","durch ungültigen Sprachschlüssel ersetzen, wenn keine deutschen Texte übernommen werden sollen","Replace by an invalid language key if German descriptions are not wanted","Sprache 1:","DEU","durch ungültigen Sprachschlüssel ersetzen, wenn keine deutschen Texte übernommen werden sollen","Replace by an invalid language key if German descriptions are not wanted","Sprache 1:","DEU","durch ungültigen Sprachschlüssel ersetzen, wenn keine deutschen Texte übernommen werden sollen","Replace by an invalid language key if German descriptions are not wanted","Sprache 1:","DEU","durch ungültigen Sprachschlüssel ersetzen, wenn keine deutschen Texte übernommen werden sollen","Replace by an invalid language key if German descriptions are not wanted","Sprache 1:","DEU","durch ungültigen Sprachschlüssel ersetzen, wenn keine deutschen Texte übernommen werden sollen","Replace by an invalid language key if German descriptions are not wanted","Sprache 1:","DEU","durch ungültigen Sprachschlüssel ersetzen, wenn keine deutschen Texte übernommen werden sollen","Replace by an invalid language key if German descriptions are not wanted","Sprache 1:","DEU","durch ungültigen Sprachschlüssel ersetzen, wenn keine deutschen Texte übernommen werden sollen","Replace by an invalid language key if German descriptions are not wanted","Sprache 1:","DEU","durch ungültigen Sprachschlüssel ersetzen, wenn keine deutschen Texte übernommen werden sollen","Replace by an invalid language key if German descriptions are not wanted","Sprache 1:","DEU","durch ungültigen Sprachschlüssel ersetzen, wenn keine deutschen Texte übernommen werden sollen","Replace by an invalid language key if German descriptions are not wanted","Sprache 1:","DEU","durch ungültigen Sprachschlüssel ersetzen, wenn keine deutschen Texte übernommen werden sollen","Replace by an invalid language key if German descriptions are not wanted","Sprache 1:","DEU","durch ungültigen Sprachschlüssel ersetzen, wenn keine deutschen Texte übernommen werden sollen","Replace by an invalid language key if German descriptions are not wanted","Sprache 1:","DEU","durch ungültigen Sprachschlüssel ersetzen, wenn keine deutschen Texte übernommen werden sollen","Replace by an invalid language key if German descriptions are not wanted","Sprache 1:","DEU","durch ungültigen Sprachschlüssel ersetzen, wenn keine deutschen Texte übernommen werden sollen","Replace by an invalid language key if German descriptions are not wanted","Sprache 1:","DEU","durch ungültigen Sprachschlüssel ersetzen, wenn keine deutschen Texte übernommen werden sollen","Replace by an invalid language key if German descriptions are not wanted","Sprache 1:","DEU","durch ungültigen Sprachschlüssel ersetzen, wenn keine deutschen Texte übernommen werden sollen","Replace by an invalid language key if German descriptions are not wanted","Sprache 1:","DEU","durch ungültigen Sprachschlüssel ersetzen, wenn keine deutschen Texte übernommen werden sollen","Replace by an invalid language key if German descriptions are not wanted","Sprache 1:","DEU","durch ungültigen Sprachschlüssel ersetzen, wenn keine deutschen Texte übernommen werden sollen","Replace by an invalid language key if German descriptions are not wanted","Sprache 1:","DEU","durch ungültigen Sprachschlüssel ersetzen, wenn keine deutschen Texte übernommen werden sollen","Replace by an invalid language key if German descriptions are not wanted","Sprache 1:","DEU","durch ungültigen Sprachschlüssel ersetzen, wenn keine deutschen Texte übernommen werden sollen","Replace by an invalid language key if German descriptions are not wanted","Sprache 1:","DEU","durch ungültigen Sprachschlüssel ersetzen, wenn keine deutschen Texte übernommen werden sollen","Replace by an invalid language key if German descriptions are not wanted","Sprache 1:","DEU","durch ungültigen Sprachschlüssel ersetzen, wenn keine deutschen Texte übernommen werden sollen","Replace by an invalid language key if German descriptions are not wanted","Sprache 1:","DEU","durch ungültigen Sprachschlüssel ersetzen, wenn keine deutschen Texte übernommen werden sollen","Replace by an invalid language key if German descriptions are not wanted","Sprache 1:","DEU","durch ungültigen Sprachschlüssel ersetzen, wenn keine deutschen Texte übernommen werden sollen","Replace by an invalid language key if German descriptions are not wanted","Sprache 1:","DEU","durch ungültigen Sprachschlüssel ersetzen, wenn keine deutschen Texte übernommen werden sollen","Replace by an invalid language key if German descriptions are not wanted","Sprache 1:","DEU","durch ungültigen Sprachschlüssel ersetzen, wenn keine deutschen Texte übernommen werden sollen","Replace by an invalid language key if German descriptions are not wanted","Sprache 1:","DEU","durch ungültigen Sprachschlüssel ersetzen, wenn keine deutschen Texte übernommen werden sollen","Replace by an invalid language key if German descriptions are not wanted","Sprache 1:","DEU","durch ungültigen Sprachschlüssel ersetzen, wenn keine deutschen Texte übernommen werden sollen","Replace by an invalid language key if German descriptions are not wanted","Sprache 1:","DEU","durch ungültigen Sprachschlüssel ersetzen, wenn keine deutschen Texte übernommen werden sollen","Replace by an invalid language key if German descriptions are not wanted","Sprache 1:","DEU","durch ungültigen Sprachschlüssel ersetzen, wenn keine deutschen Texte übernommen werden sollen","Replace by an invalid language key if German descriptions are not wanted","Sprache 1:","DEU","durch ungültigen Sprachschlüssel ersetzen, wenn keine deutschen Texte übernommen werden sollen","Replace by an invalid language key if German descriptions are not wanted","Sprache 1:","DEU","durch ungültigen Sprachschlüssel ersetzen, wenn keine deutschen Texte übernommen werden sollen","Replace by an invalid language key if German descriptions are not wanted","Sprache 1:","DEU","durch ungültigen Sprachschlüssel ersetzen, wenn keine deutschen Texte übernommen werden sollen","Replace by an invalid language key if German descriptions are not wanted","Sprache 1:","DEU","durch ungültigen Sprachschlüssel ersetzen, wenn keine deutschen Texte übernommen werden sollen","Replace by an invalid language key if German descriptions are not wanted","Sprache 1:","DEU","durch ungültigen Sprachschlüssel ersetzen, wenn keine deutschen Texte übernommen werden sollen","Replace by an invalid language key if German descriptions are not wanted","Sprache 1:","DEU","durch ungültigen Sprachschlüssel ersetzen, wenn keine deutschen Texte übernommen werden sollen","Replace by an invalid language key if German descriptions are not wanted","Sprache 1:","DEU","durch ungültigen Sprachschlüssel ersetzen, wenn keine deutschen Texte übernommen werden sollen","Replace by an invalid language key if German descriptions are not wanted","Sprache 1:","DEU","durch ungültigen Sprachschlüssel ersetzen, wenn keine deutschen Texte übernommen werden sollen","Replace by an invalid language key if German descriptions are not wanted","Sprache 1:","DEU","durch ungültigen Sprachschlüssel ersetzen, wenn keine deutschen Texte übernommen werden sollen","Replace by an invalid language key if German descriptions are not wanted","Sprache 1:","DEU","durch ungültigen Sprachschlüssel ersetzen, wenn keine deutschen Texte übernommen werden sollen","Replace by an invalid language key if German descriptions are not wanted","Sprache 1:","DEU","durch ungültigen Sprachschlüssel ersetzen, wenn keine deutschen Texte übernommen werden sollen","Replace by an invalid language key if German descriptions are not wanted","Sprache 1:","DEU","durch ungültigen Sprachschlüssel ersetzen, wenn keine deutschen Texte übernommen werden sollen","Replace by an invalid language key if German descriptions are not wanted","Sprache 1:","DEU","durch ungültigen Sprachschlüssel ersetzen, wenn keine deutschen Texte übernommen werden sollen","Replace by an invalid language key if German descriptions are not wanted","Sprache 1:","DEU","durch ungültigen Sprachschlüssel ersetzen, wenn keine deutschen Texte übernommen werden sollen","Replace by an invalid language key if German descriptions are not wanted","Sprache 1:","DEU","durch ungültigen Sprachschlüssel ersetzen, wenn keine deutschen Texte übernommen werden sollen","Replace by an invalid language key if German descriptions are not wanted","Sprache 1:","DEU","durch ungültigen Sprachschlüssel ersetzen, wenn keine deutschen Texte übernommen werden sollen","Replace by an invalid language key if German descriptions are not wanted","Sprache 1:","DEU","durch ungültigen Sprachschlüssel ersetzen, wenn keine deutschen Texte übernommen werden sollen","Replace by an invalid language key if German descriptions are not wanted","Sprache 1:","DEU","durch ungültigen Sprachschlüssel ersetzen, wenn keine deutschen Texte übernommen werden sollen","Replace by an invalid language key if German descriptions are not wanted","Sprache 1:","DEU","durch ungültigen Sprachschlüssel ersetzen, wenn keine deutschen Texte übernommen werden sollen","Replace by an invalid language key if German descriptions are not wanted","Sprache 1:","DEU","durch ungültigen Sprachschlüssel ersetzen, wenn keine deutschen Texte übernommen werden sollen","Replace by an invalid language key if German descriptions are not wanted","Sprache 1:","DEU","durch ungültigen Sprachschlüssel ersetzen, wenn keine deutschen Texte übernommen werden sollen","Replace by an invalid language key if German descriptions are not wanted","Sprache 1:","DEU","durch ungültigen Sprachschlüssel ersetzen, wenn keine deutschen Texte übernommen werden sollen","Replace by an invalid language key if German descriptions are not wanted","Sprache 1:","DEU","durch ungültigen Sprachschlüssel ersetzen, wenn keine deutschen Texte übernommen werden sollen","Replace by an invalid language key if German descriptions are not wanted","Sprache 1:","DEU","durch ungültigen Sprachschlüssel ersetzen, wenn keine deutschen Texte übernommen werden sollen","Replace by an invalid language key if German descriptions are not wanted","Sprache 1:","DEU","durch ungültigen Sprachschlüssel ersetzen, wenn keine deutschen Texte übernommen werden sollen","Replace by an invalid language key if German descriptions are not wanted","Sprache 1:","DEU","durch ungültigen Sprachschlüssel ersetzen, wenn keine deutschen Texte übernommen werden sollen","Replace by an invalid language key if German descriptions are not wanted","Sprache 1:","DEU","durch ungültigen Sprachschlüssel ersetzen, wenn keine deutschen Texte übernommen werden sollen","Replace by an invalid language key if German descriptions are not wanted","Sprache 1:","DEU","durch ungültigen Sprachschlüssel ersetzen, wenn keine deutschen Texte übernommen werden sollen","Replace by an invalid language key if German descriptions are not wanted","Sprache 1:","DEU","durch ungültigen Sprachschlüssel ersetzen, wenn keine deutschen Texte übernommen werden sollen","Replace by an invalid language key if German descriptions are not wanted","Sprache 1:","DEU","durch ungültigen Sprachschlüssel ersetzen, wenn keine deutschen Texte übernommen werden sollen","Replace by an invalid language key if German descriptions are not wanted","Sprache 1:","DEU","durch ungültigen Sprachschlüssel ersetzen, wenn keine deutschen Texte übernommen werden sollen","Replace by an invalid language key if German descriptions are not wanted","Sprache 1:","DEU","durch ungültigen Sprachschlüssel ersetzen, wenn keine deutschen Texte übernommen werden sollen","Replace by an invalid language key if German descriptions are not wanted","Sprache 1:","DEU","durch ungültigen Sprachschlüssel ersetzen, wenn keine deutschen Texte übernommen werden sollen","Replace by an invalid language key if German descriptions are not wanted","Sprache 1:","DEU","durch ungültigen Sprachschlüssel ersetzen, wenn keine deutschen Texte übernommen werden sollen","Replace by an invalid language key if German descriptions are not wanted","Sprache 1:","DEU","durch ungültigen Sprachschlüssel ersetzen, wenn keine deutschen Texte übernommen werden sollen","Replace by an invalid language key if German descriptions are not wanted","Sprache 1:","DEU","durch ungültigen Sprachschlüssel ersetzen, wenn keine deutschen Texte übernommen werden sollen","Replace by an invalid language key if German descriptions are not wanted","Sprache 1:","DEU","durch ungültigen Sprachschlüssel ersetzen, wenn keine deutschen Texte übernommen werden sollen","Replace by an invalid language key if German descriptions are not wanted","Sprache 1:","DEU","durch ungültigen Sprachschlüssel ersetzen, wenn keine deutschen Texte übernommen werden sollen","Replace by an invalid language key if German descriptions are not wanted","Sprache 1:","DEU","durch ungültigen Sprachschlüssel ersetzen, wenn keine deutschen Texte übernommen werden sollen","Replace by an invalid language key if German descriptions are not wanted","Sprache 1:","DEU","durch ungültigen Sprachschlüssel ersetzen, wenn keine deutschen Texte übernommen werden sollen","Replace by an invalid language key if German descriptions are not wanted","Sprache 1:","DEU","durch ungültigen Sprachschlüssel ersetzen, wenn keine deutschen Texte übernommen werden sollen","Replace by an invalid language key if German descriptions are not wanted","Sprache 1:","DEU","durch ungültigen Sprachschlüssel ersetzen, wenn keine deutschen Texte übernommen werden sollen","Replace by an invalid language key if German descriptions are not wanted","Sprache 1:","DEU","durch ungültigen Sprachschlüssel ersetzen, wenn keine deutschen Texte übernommen werden sollen","Replace by an invalid language key if German descriptions are not wanted","Sprache 1:","DEU","durch ungültigen Sprachschlüssel ersetzen, wenn keine deutschen Texte übernommen werden sollen","Replace by an invalid language key if German descriptions are not wanted","Sprache 1:","DEU","durch ungültigen Sprachschlüssel ersetzen, wenn keine deutschen Texte übernommen werden sollen","Replace by an invalid language key if German descriptions are not wanted","Sprache 1:","DEU","durch ungültigen Sprachschlüssel ersetzen, wenn keine deutschen Texte übernommen werden sollen","Replace by an invalid language key if German descriptions are not wanted","Sprache 1:","DEU","durch ungültigen Sprachschlüssel ersetzen, wenn keine deutschen Texte übernommen werden sollen","Replace by an invalid language key if German descriptions are not wanted","Sprache 1:","DEU","durch ungültigen Sprachschlüssel ersetzen, wenn keine deutschen Texte übernommen werden sollen","Replace by an invalid language key if German descriptions are not wanted","Sprache 1:","DEU","durch ungültigen Sprachschlüssel ersetzen, wenn keine deutschen Texte übernommen werden sollen","Replace by an invalid language key if German descriptions are not wanted","Sprache 1:","DEU","durch ungültigen Sprachschlüssel ersetzen, wenn keine deutschen Texte übernommen werden sollen","Replace by an invalid language key if German descriptions are not wanted","Sprache 1:","DEU","durch ungültigen Sprachschlüssel ersetzen, wenn keine deutschen Texte übernommen werden sollen","Replace by an invalid language key if German descriptions are not wanted","Sprache 1:","DEU","durch ungültigen Sprachschlüssel ersetzen, wenn keine deutschen Texte übernommen werden sollen","Replace by an invalid language key if German descriptions are not wanted","Sprache 1:","DEU","durch ungültigen Sprachschlüssel ersetzen, wenn keine deutschen Texte übernommen werden sollen","Replace by an invalid language key if German descriptions are not wanted","Sprache 1:","DEU","durch ungültigen Sprachschlüssel ersetzen, wenn keine deutschen Texte übernommen werden sollen","Replace by an invalid language key if German descriptions are not wanted","Sprache 1:","DEU","durch ungültigen Sprachschlüssel ersetzen, wenn keine deutschen Texte übernommen werden sollen","Replace by an invalid language key if German descriptions are not wanted","Sprache 1:","DEU","durch ungültigen Sprachschlüssel ersetzen, wenn keine deutschen Texte übernommen werden sollen","Replace by an invalid language key if German descriptions are not wanted","Sprache 1:","DEU","durch ungültigen Sprachschlüssel ersetzen, wenn keine deutschen Texte übernommen werden sollen","Replace by an invalid language key if German descriptions are not wanted","Sprache 1:","DEU","durch ungültigen Sprachschlüssel ersetzen, wenn keine deutschen Texte übernommen werden sollen","Replace by an invalid language key if German descriptions are not wanted","Sprache 1:","DEU","durch ungültigen Sprachschlüssel ersetzen, wenn keine deutschen Texte übernommen werden sollen","Replace by an invalid language key if German descriptions are not wanted","Sprache 1:","DEU","durch ungültigen Sprachschlüssel ersetzen, wenn keine deutschen Texte übernommen werden sollen","Replace by an invalid language key if German descriptions are not wanted","Sprache 1:","DEU","durch ungültigen Sprachschlüssel ersetzen, wenn keine deutschen Texte übernommen werden sollen","Replace by an invalid language key if German descriptions are not wanted","Sprache 1:","DEU","durch ungültigen Sprachschlüssel ersetzen, wenn keine deutschen Texte übernommen werden sollen","Replace by an invalid language key if German descriptions are not wanted","Sprache 1:","DEU","durch ungültigen Sprachschlüssel ersetzen, wenn keine deutschen Texte übernommen werden sollen","Replace by an invalid language key if German descriptions are not wanted","Sprache 1:","DEU","durch ungültigen Sprachschlüssel ersetzen, wenn keine deutschen Texte übernommen werden sollen","Replace by an invalid language key if German descriptions are not wanted","Sprache 1:","DEU","durch ungültigen Sprachschlüssel ersetzen, wenn keine deutschen Texte übernommen werden sollen","Replace by an invalid language key if German descriptions are not wanted","Sprache 1:","DEU","durch ungültigen Sprachschlüssel ersetzen, wenn keine deutschen Texte übernommen werden sollen","Replace by an invalid language key if German descriptions are not wanted","Sprache 1:","DEU","durch ungültigen Sprachschlüssel ersetzen, wenn keine deutschen Texte übernommen werden sollen","Replace by an invalid language key if German descriptions are not wanted","Sprache 1:","DEU","durch ungültigen Sprachschlüssel ersetzen, wenn keine deutschen Texte übernommen werden sollen","Replace by an invalid language key if German descriptions are not wanted","Sprache 1:","DEU","durch ungültigen Sprachschlüssel ersetzen, wenn keine deutschen Texte übernommen werden sollen","Replace by an invalid language key if German descriptions are not wanted","Sprache 1:","DEU","durch ungültigen Sprachschlüssel ersetzen, wenn keine deutschen Texte übernommen werden sollen","Replace by an invalid language key if German descriptions are not wanted","Sprache 1:","DEU","durch ungültigen Sprachschlüssel ersetzen, wenn keine deutschen Texte übernommen werden sollen","Replace by an invalid language key if German descriptions are not wanted","Sprache 1:","DEU","durch ungültigen Sprachschlüssel ersetzen, wenn keine deutschen Texte übernommen werden sollen","Replace by an invalid language key if German descriptions are not wanted","Sprache 1:","DEU","durch ungültigen Sprachschlüssel ersetzen, wenn keine deutschen Texte übernommen werden sollen","Replace by an invalid language key if German descriptions are not wanted","Sprache 1:","DEU","durch ungültigen Sprachschlüssel ersetzen, wenn keine deutschen Texte übernommen werden sollen","Replace by an invalid language key if German descriptions are not wanted","Sprache 1:","DEU","durch ungültigen Sprachschlüssel ersetzen, wenn keine deutschen Texte übernommen werden sollen","Replace by an invalid language key if German descriptions are not wanted","Sprache 1:","DEU","durch ungültigen Sprachschlüssel ersetzen, wenn keine deutschen Texte übernommen werden sollen","Replace by an invalid language key if German descriptions are not wanted","Sprache 1:","DEU","durch ungültigen Sprachschlüssel ersetzen, wenn keine deutschen Texte übernommen werden sollen","Replace by an invalid language key if German descriptions are not wanted","Sprache 1:","DEU","durch ungültigen Sprachschlüssel ersetzen, wenn keine deutschen Texte übernommen werden sollen","Replace by an invalid language key if German descriptions are not wanted","Sprache 1:","DEU","durch ungültigen Sprachschlüssel ersetzen, wenn keine deutschen Texte übernommen werden sollen","Replace by an invalid language key if German descriptions are not wanted","Sprache 1:","DEU","durch ungültigen Sprachschlüssel ersetzen, wenn keine deutschen Texte übernommen werden sollen","Replace by an invalid language key if German descriptions are not wanted","Sprache 1:","DEU","durch ungültigen Sprachschlüssel ersetzen, wenn keine deutschen Texte übernommen werden sollen","Replace by an invalid language key if German descriptions are not wanted","Sprache 1:","DEU","durch ungültigen Sprachschlüssel ersetzen, wenn keine deutschen Texte übernommen werden sollen","Replace by an invalid language key if German descriptions are not wanted","Sprache 1:","DEU","durch ungültigen Sprachschlüssel ersetzen, wenn keine deutschen Texte übernommen werden sollen","Replace by an invalid language key if German descriptions are not wanted","Sprache 1:","DEU","durch ungültigen Sprachschlüssel ersetzen, wenn keine deutschen Texte übernommen werden sollen","Replace by an invalid language key if German descriptions are not wanted","Sprache 1:","DEU","durch ungültigen Sprachschlüssel ersetzen, wenn keine deutschen Texte übernommen werden sollen","Replace by an invalid language key if German descriptions are not wanted","Sprache 1:","DEU","durch ungültigen Sprachschlüssel ersetzen, wenn keine deutschen Texte übernommen werden sollen","Replace by an invalid language key if German descriptions are not wanted","Sprache 1:","DEU","durch ungültigen Sprachschlüssel ersetzen, wenn keine deutschen Texte übernommen werden sollen","Replace by an invalid language key if German descriptions are not wanted","Sprache 1:","DEU","durch ungültigen Sprachschlüssel ersetzen, wenn keine deutschen Texte übernommen werden sollen","Replace by an invalid language key if German descriptions are not wanted","Sprache 1:","DEU","durch ungültigen Sprachschlüssel ersetzen, wenn keine deutschen Texte übernommen werden sollen","Replace by an invalid language key if German descriptions are not wanted","Sprache 1:","DEU","durch ungültigen Sprachschlüssel ersetzen, wenn keine deutschen Texte übernommen werden sollen","Replace by an invalid language key if German descriptions are not wanted","Sprache 1:","DEU","durch ungültigen Sprachschlüssel ersetzen, wenn keine deutschen Texte übernommen werden sollen","Replace by an invalid language key if German descriptions are not wanted","Sprache 1:","DEU","durch ungültigen Sprachschlüssel ersetzen, wenn keine deutschen Texte übernommen werden sollen","Replace by an invalid language key if German descriptions are not wanted","Sprache 1:","DEU","durch ungültigen Sprachschlüssel ersetzen, wenn keine deutschen Texte übernommen werden sollen","Replace by an invalid language key if German descriptions are not wanted","Sprache 1:","DEU","durch ungültigen Sprachschlüssel ersetzen, wenn keine deutschen Texte übernommen werden sollen","Replace by an invalid language key if German descriptions are not wanted","Sprache 1:","DEU","durch ungültigen Sprachschlüssel ersetzen, wenn keine deutschen Texte übernommen werden sollen","Replace by an invalid language key if German descriptions are not wanted","Sprache 1:","DEU","durch ungültigen Sprachschlüssel ersetzen, wenn keine deutschen Texte übernommen werden sollen","Replace by an invalid language key if German descriptions are not wanted","Sprache 1:","DEU","durch ungültigen Sprachschlüssel ersetzen, wenn keine deutschen Texte übernommen werden sollen","Replace by an invalid language key if German descriptions are not wanted","Sprache 1:","DEU","durch ungültigen Sprachschlüssel ersetzen, wenn keine deutschen Texte übernommen werden sollen","Replace by an invalid language key if German descriptions are not wanted","Sprache 1:","DEU","durch ungültigen Sprachschlüssel ersetzen, wenn keine deutschen Texte übernommen werden sollen","Replace by an invalid language key if German descriptions are not wanted","Sprache 1:","DEU","durch ungültigen Sprachschlüssel ersetzen, wenn keine deutschen Texte übernommen werden sollen","Replace by an invalid language key if German descriptions are not wanted","Sprache 1:","DEU","durch ungültigen Sprachschlüssel ersetzen, wenn keine deutschen Texte übernommen werden sollen","Replace by an invalid language key if German descriptions are not wanted","Sprache 1:","DEU","durch ungültigen Sprachschlüssel ersetzen, wenn keine deutschen Texte übernommen werden sollen","Replace by an invalid language key if German descriptions are not wanted","Sprache 1:","DEU","durch ungültigen Sprachschlüssel ersetzen, wenn keine deutschen Texte übernommen werden sollen","Replace by an invalid language key if German descriptions are not wanted","Sprache 1:","DEU","durch ungültigen Sprachschlüssel ersetzen, wenn keine deutschen Texte übernommen werden sollen","Replace by an invalid language key if German descriptions are not wanted","Sprache 1:","DEU","durch ungültigen Sprachschlüssel ersetzen, wenn keine deutschen Texte übernommen werden sollen","Replace by an invalid language key if German descriptions are not wanted","Sprache 1:","DEU","durch ungültigen Sprachschlüssel ersetzen, wenn keine deutschen Texte übernommen werden sollen","Replace by an invalid language key if German descriptions are not wanted","Sprache 1:","DEU","durch ungültigen Sprachschlüssel ersetzen, wenn keine deutschen Texte übernommen werden sollen","Replace by an invalid language key if German descriptions are not wanted","Sprache 1:","DEU","durch ungültigen Sprachschlüssel ersetzen, wenn keine deutschen Texte übernommen werden sollen","Replace by an invalid language key if German descriptions are not wanted","Sprache 1:","DEU","durch ungültigen Sprachschlüssel ersetzen, wenn keine deutschen Texte übernommen werden sollen","Replace by an invalid language key if German descriptions are not wanted","Sprache 1:","DEU","durch ungültigen Sprachschlüssel ersetzen, wenn keine deutschen Texte übernommen werden sollen","Replace by an invalid language key if German descriptions are not wanted","Sprache 1:","DEU","durch ungültigen Sprachschlüssel ersetzen, wenn keine deutschen Texte übernommen werden sollen","Replace by an invalid language key if German descriptions are not wanted","Sprache 1:","DEU","durch ungültigen Sprachschlüssel ersetzen, wenn keine deutschen Texte übernommen werden sollen","Replace by an invalid language key if German descriptions are not wanted","Sprache 1:","DEU","durch ungültigen Sprachschlüssel ersetzen, wenn keine deutschen Texte übernommen werden sollen","Replace by an invalid language key if German descriptions are not wanted","Sprache 1:","DEU","durch ungültigen Sprachschlüssel ersetzen, wenn keine deutschen Texte übernommen werden sollen","Replace by an invalid language key if German descriptions are not wanted","Sprache 1:","DEU","durch ungültigen Sprachschlüssel ersetzen, wenn keine deutschen Texte übernommen werden sollen","Replace by an invalid language key if German descriptions are not wanted","Sprache 1:","DEU","durch ungültigen Sprachschlüssel ersetzen, wenn keine deutschen Texte übernommen werden sollen","Replace by an invalid language key if German descriptions are not wanted","Sprache 1:","DEU","durch ungültigen Sprachschlüssel ersetzen, wenn keine deutschen Texte übernommen werden sollen","Replace by an invalid language key if German descriptions are not wanted","Sprache 1:","DEU","durch ungültigen Sprachschlüssel ersetzen, wenn keine deutschen Texte übernommen werden sollen","Replace by an invalid language key if German descriptions are not wanted","Sprache 1:","DEU","durch ungültigen Sprachschlüssel ersetzen, wenn keine deutschen Texte übernommen werden sollen","Replace by an invalid language key if German descriptions are not wanted","Sprache 1:","DEU","durch ungültigen Sprachschlüssel ersetzen, wenn keine deutschen Texte übernommen werden sollen","Replace by an invalid language key if German descriptions are not wanted","Sprache 1:","DEU","durch ungültigen Sprachschlüssel ersetzen, wenn keine deutschen Texte übernommen werden sollen","Replace by an invalid language key if German descriptions are not wanted","Sprache 1:","DEU","durch ungültigen Sprachschlüssel ersetzen, wenn keine deutschen Texte übernommen werden sollen","Replace by an invalid language key if German descriptions are not wanted","Sprache 1:","DEU","durch ungültigen Sprachschlüssel ersetzen, wenn keine deutschen Texte übernommen werden sollen","Replace by an invalid language key if German descriptions are not wanted","Sprache 1:","DEU","durch ungültigen Sprachschlüssel ersetzen, wenn keine deutschen Texte übernommen werden sollen","Replace by an invalid language key if German descriptions are not wanted","Sprache 1:","DEU","durch ungültigen Sprachschlüssel ersetzen, wenn keine deutschen Texte übernommen werden sollen","Replace by an invalid language key if German descriptions are not wanted","Sprache 1:","DEU","durch ungültigen Sprachschlüssel ersetzen, wenn keine deutschen Texte übernommen werden sollen","Replace by an invalid language key if German descriptions are not wanted","Sprache 1:","DEU","durch ungültigen Sprachschlüssel ersetzen, wenn keine deutschen Texte übernommen werden sollen","Replace by an invalid language key if German descriptions are not wanted","Sprache 1:","DEU","durch ungültigen Sprachschlüssel ersetzen, wenn keine deutschen Texte übernommen werden sollen","Replace by an invalid language key if German descriptions are not wanted","Sprache 1:","DEU","durch ungültigen Sprachschlüssel ersetzen, wenn keine deutschen Texte übernommen werden sollen","Replace by an invalid language key if German descriptions are not wanted","Sprache 1:","DEU","durch ungültigen Sprachschlüssel ersetzen, wenn keine deutschen Texte übernommen werden sollen","Replace by an invalid language key if German descriptions are not wanted","Sprache 1:","DEU","durch ungültigen Sprachschlüssel ersetzen, wenn keine deutschen Texte übernommen werden sollen","Replace by an invalid language key if German descriptions are not wanted","Sprache 1:","DEU","durch ungültigen Sprachschlüssel ersetzen, wenn keine deutschen Texte übernommen werden sollen","Replace by an invalid language key if German descriptions are not wanted","Sprache 1:","DEU","durch ungültigen Sprachschlüssel ersetzen, wenn keine deutschen Texte übernommen werden sollen","Replace by an invalid language key if German descriptions are not wanted","Sprache 1:","DEU","durch ungültigen Sprachschlüssel ersetzen, wenn keine deutschen Texte übernommen werden sollen","Replace by an invalid language key if German descriptions are not wanted","Sprache 1:","DEU","durch ungültigen Sprachschlüssel ersetzen, wenn keine deutschen Texte übernommen werden sollen","Replace by an invalid language key if German descriptions are not wanted","Sprache 1:","DEU","durch ungültigen Sprachschlüssel ersetzen, wenn keine deutschen Texte übernommen werden sollen","Replace by an invalid language key if German descriptions are not wanted","Sprache 1:","DEU","durch ungültigen Sprachschlüssel ersetzen, wenn keine deutschen Texte übernommen werden sollen","Replace by an invalid language key if German descriptions are not wanted","Sprache 1:","DEU","durch ungültigen Sprachschlüssel ersetzen, wenn keine deutschen Texte übernommen werden sollen","Replace by an invalid language key if German descriptions are not wanted","Sprache 1:","DEU","durch ungültigen Sprachschlüssel ersetzen, wenn keine deutschen Texte übernommen werden sollen","Replace by an invalid language key if German descriptions are not wanted","Sprache 1:","DEU","durch ungültigen Sprachschlüssel ersetzen, wenn keine deutschen Texte übernommen werden sollen","Replace by an invalid language key if German descriptions are not wanted","Sprache 1:","DEU","durch ungültigen Sprachschlüssel ersetzen, wenn keine deutschen Texte übernommen werden sollen","Replace by an invalid language key if German descriptions are not wanted","Sprache 1:","DEU","durch ungültigen Sprachschlüssel ersetzen, wenn keine deutschen Texte übernommen werden sollen","Replace by an invalid language key if German descriptions are not wanted","Sprache 1:","DEU","durch ungültigen Sprachschlüssel ersetzen, wenn keine deutschen Texte übernommen werden sollen","Replace by an invalid language key if German descriptions are not wanted","Sprache 1:","DEU","durch ungültigen Sprachschlüssel ersetzen, wenn keine deutschen Texte übernommen werden sollen","Replace by an invalid language key if German descriptions are not wanted","Sprache 1:","DEU","durch ungültigen Sprachschlüssel ersetzen, wenn keine deutschen Texte übernommen werden sollen","Replace by an invalid language key if German descriptions are not wanted","Sprache 1:","DEU","durch ungültigen Sprachschlüssel ersetzen, wenn keine deutschen Texte übernommen werden sollen","Replace by an invalid language key if German descriptions are not wanted","Sprache 1:","DEU","durch ungültigen Sprachschlüssel ersetzen, wenn keine deutschen Texte übernommen werden sollen","Replace by an invalid language key if German descriptions are not wanted","Sprache 1:","DEU","durch ungültigen Sprachschlüssel ersetzen, wenn keine deutschen Texte übernommen werden sollen","Replace by an invalid language key if German descriptions are not wanted","Sprache 1:","DEU","durch ungültigen Sprachschlüssel ersetzen, wenn keine deutschen Texte übernommen werden sollen","Replace by an invalid language key if German descriptions are not wanted","Sprache 1:","DEU","durch ungültigen Sprachschlüssel ersetzen, wenn keine deutschen Texte übernommen werden sollen","Replace by an invalid language key if German descriptions are not wanted","Sprache 1:","DEU","durch ungültigen Sprachschlüssel ersetzen, wenn keine deutschen Texte übernommen werden sollen","Replace by an invalid language key if German descriptions are not wanted","Sprache 1:","DEU","durch ungültigen Sprachschlüssel ersetzen, wenn keine deutschen Texte übernommen werden sollen","Replace by an invalid language key if German descriptions are not wanted","Sprache 1:","DEU","durch ungültigen Sprachschlüssel ersetzen, wenn keine deutschen Texte übernommen werden sollen","Replace by an invalid language key if German descriptions are not wanted","Sprache 1:","DEU","durch ungültigen Sprachschlüssel ersetzen, wenn keine deutschen Texte übernommen werden sollen","Replace by an invalid language key if German descriptions are not wanted","Sprache 1:","DEU","durch ungültigen Sprachschlüssel ersetzen, wenn keine deutschen Texte übernommen werden sollen","Replace by an invalid language key if German descriptions are not wanted","Sprache 1:","DEU","durch ungültigen Sprachschlüssel ersetzen, wenn keine deutschen Texte übernommen werden sollen","Replace by an invalid language key if German descriptions are not wanted","Sprache 1:","DEU","durch ungültigen Sprachschlüssel ersetzen, wenn keine deutschen Texte übernommen werden sollen","Replace by an invalid language key if German descriptions are not wanted","Sprache 1:","DEU","durch ungültigen Sprachschlüssel ersetzen, wenn keine deutschen Texte übernommen werden sollen","Replace by an invalid language key if German descriptions are not wanted","Sprache 1:","DEU","durch ungültigen Sprachschlüssel ersetzen, wenn keine deutschen Texte übernommen werden sollen","Replace by an invalid language key if German descriptions are not wanted","Sprache 1:","DEU","durch ungültigen Sprachschlüssel ersetzen, wenn keine deutschen Texte übernommen werden sollen","Replace by an invalid language key if German descriptions are not wanted","Sprache 1:","DEU","durch ungültigen Sprachschlüssel ersetzen, wenn keine deutschen Texte übernommen werden sollen","Replace by an invalid language key if German descriptions are not wanted","Sprache 1:","DEU","durch ungültigen Sprachschlüssel ersetzen, wenn keine deutschen Texte übernommen werden sollen","Replace by an invalid language key if German descriptions are not wanted","Sprache 1:","DEU","durch ungültigen Sprachschlüssel ersetzen, wenn keine deutschen Texte übernommen werden sollen","Replace by an invalid language key if German descriptions are not wanted","Sprache 1:","DEU","durch ungültigen Sprachschlüssel ersetzen, wenn keine deutschen Texte übernommen werden sollen","Replace by an invalid language key if German descriptions are not wanted","Sprache 1:","DEU","durch ungültigen Sprachschlüssel ersetzen, wenn keine deutschen Texte übernommen werden sollen","Replace by an invalid language key if German descriptions are not wanted","Sprache 1:","DEU","durch ungültigen Sprachschlüssel ersetzen, wenn keine deutschen Texte übernommen werden sollen","Replace by an invalid language key if German descriptions are not wanted","Sprache 1:","DEU","durch ungültigen Sprachschlüssel ersetzen, wenn keine deutschen Texte übernommen werden sollen","Replace by an invalid language key if German descriptions are not wanted","Sprache 1:","DEU","durch ungültigen Sprachschlüssel ersetzen, wenn keine deutschen Texte übernommen werden sollen","Replace by an invalid language key if German descriptions are not wanted","Sprache 1:","DEU","durch ungültigen Sprachschlüssel ersetzen, wenn keine deutschen Texte übernommen werden sollen","Replace by an invalid language key if German descriptions are not wanted","Sprache 1:","DEU","durch ungültigen Sprachschlüssel ersetzen, wenn keine deutschen Texte übernommen werden sollen","Replace by an invalid language key if German descriptions are not wanted","Sprache 1:","DEU","durch ungültigen Sprachschlüssel ersetzen, wenn keine deutschen Texte übernommen werden sollen","Replace by an invalid language key if German descriptions are not wanted","Sprache 1:","DEU","durch ungültigen Sprachschlüssel ersetzen, wenn keine deutschen Texte übernommen werden sollen","Replace by an invalid language key if German descriptions are not wanted","Sprache 1:","DEU","durch ungültigen Sprachschlüssel ersetzen, wenn keine deutschen Texte übernommen werden sollen","Replace by an invalid language key if German descriptions are not wanted","Sprache 1:","DEU","durch ungültigen Sprachschlüssel ersetzen, wenn keine deutschen Texte übernommen werden sollen","Replace by an invalid language key if German descriptions are not wanted","Sprache 1:","DEU","durch ungültigen Sprachschlüssel ersetzen, wenn keine deutschen Texte übernommen werden sollen","Replace by an invalid language key if German descriptions are not wanted","Sprache 1:","DEU","durch ungültigen Sprachschlüssel ersetzen, wenn keine deutschen Texte übernommen werden sollen","Replace by an invalid language key if German descriptions are not wanted","Sprache 1:","DEU","durch ungültigen Sprachschlüssel ersetzen, wenn keine deutschen Texte übernommen werden sollen","Replace by an invalid language key if German descriptions are not wanted","Sprache 1:","DEU","durch ungültigen Sprachschlüssel ersetzen, wenn keine deutschen Texte übernommen werden sollen","Replace by an invalid language key if German descriptions are not wanted","Sprache 1:","DEU","durch ungültigen Sprachschlüssel ersetzen, wenn keine deutschen Texte übernommen werden sollen","Replace by an invalid language key if German descriptions are not wanted","Sprache 1:","DEU","durch ungültigen Sprachschlüssel ersetzen, wenn keine deutschen Texte übernommen werden sollen","Replace by an invalid language key if German descriptions are not wanted","Sprache 1:","DEU","durch ungültigen Sprachschlüssel ersetzen, wenn keine deutschen Texte übernommen werden sollen","Replace by an invalid language key if German descriptions are not wanted","Sprache 1:","DEU","durch ungültigen Sprachschlüssel ersetzen, wenn keine deutschen Texte übernommen werden sollen","Replace by an invalid language key if German descriptions are not wanted","Sprache 1:","DEU","durch ungültigen Sprachschlüssel ersetzen, wenn keine deutschen Texte übernommen werden sollen","Replace by an invalid language key if German descriptions are not wanted","Sprache 1:","DEU","durch ungültigen Sprachschlüssel ersetzen, wenn keine deutschen Texte übernommen werden sollen","Replace by an invalid language key if German descriptions are not wanted","Sprache 1:","DEU","durch ungültigen Sprachschlüssel ersetzen, wenn keine deutschen Texte übernommen werden sollen","Replace by an invalid language key if German descriptions are not wanted","Sprache 1:","DEU","durch ungültigen Sprachschlüssel ersetzen, wenn keine deutschen Texte übernommen werden sollen","Replace by an invalid language key if German descriptions are not wanted","Sprache 1:","DEU","durch ungültigen Sprachschlüssel ersetzen, wenn keine deutschen Texte übernommen werden sollen","Replace by an invalid language key if German descriptions are not wanted","Sprache 1:","DEU","durch ungültigen Sprachschlüssel ersetzen, wenn keine deutschen Texte übernommen werden sollen","Replace by an invalid language key if German descriptions are not wanted","Sprache 1:","DEU","durch ungültigen Sprachschlüssel ersetzen, wenn keine deutschen Texte übernommen werden sollen","Replace by an invalid language key if German descriptions are not wanted","Sprache 1:","DEU","durch ungültigen Sprachschlüssel ersetzen, wenn keine deutschen Texte übernommen werden sollen","Replace by an invalid language key if German descriptions are not wanted","Sprache 1:","DEU","durch ungültigen Sprachschlüssel ersetzen, wenn keine deutschen Texte übernommen werden sollen","Replace by an invalid language key if German descriptions are not wanted","Sprache 1:","DEU","durch ungültigen Sprachschlüssel ersetzen, wenn keine deutschen Texte übernommen werden sollen","Replace by an invalid language key if German descriptions are not wanted","Sprache 1:","DEU","durch ungültigen Sprachschlüssel ersetzen, wenn keine deutschen Texte übernommen werden sollen","Replace by an invalid language key if German descriptions are not wanted","Sprache 1:","DEU","durch ungültigen Sprachschlüssel ersetzen, wenn keine deutschen Texte übernommen werden sollen","Replace by an invalid language key if German descriptions are not wanted","Sprache 1:","DEU","durch ungültigen Sprachschlüssel ersetzen, wenn keine deutschen Texte übernommen werden sollen","Replace by an invalid language key if German descriptions are not wanted","Sprache 1:","DEU","durch ungültigen Sprachschlüssel ersetzen, wenn keine deutschen Texte übernommen werden sollen","Replace by an invalid language key if German descriptions are not wanted","Sprache 1:","DEU","durch ungültigen Sprachschlüssel ersetzen, wenn keine deutschen Texte übernommen werden sollen","Replace by an invalid language key if German descriptions are not wanted","Sprache 1:","DEU","durch ungültigen Sprachschlüssel ersetzen, wenn keine deutschen Texte übernommen werden sollen","Replace by an invalid language key if German descriptions are not wanted","Sprache 1:","DEU","durch ungültigen Sprachschlüssel ersetzen, wenn keine deutschen Texte übernommen werden sollen","Replace by an invalid language key if German descriptions are not wanted","Sprache 1:","DEU","durch ungültigen Sprachschlüssel ersetzen, wenn keine deutschen Texte übernommen werden sollen","Replace by an invalid language key if German descriptions are not wanted","Sprache 1:","DEU","durch ungültigen Sprachschlüssel ersetzen, wenn keine deutschen Texte übernommen werden sollen","Replace by an invalid language key if German descriptions are not wanted","Sprache 1:","DEU","durch ungültigen Sprachschlüssel ersetzen, wenn keine deutschen Texte übernommen werden sollen","Replace by an invalid language key if German descriptions are not wanted","Sprache 1:","DEU","durch ungültigen Sprachschlüssel ersetzen, wenn keine deutschen Texte übernommen werden sollen","Replace by an invalid language key if German descriptions are not wanted","Sprache 1:","DEU","durch ungültigen Sprachschlüssel ersetzen, wenn keine deutschen Texte übernommen werden sollen","Replace by an invalid language key if German descriptions are not wanted","Sprache 1:","DEU","durch ungültigen Sprachschlüssel ersetzen, wenn keine deutschen Texte übernommen werden sollen","Replace by an invalid language key if German descriptions are not wanted","Sprache 1:","DEU","durch ungültigen Sprachschlüssel ersetzen, wenn keine deutschen Texte übernommen werden sollen","Replace by an invalid language key if German descriptions are not wanted","Sprache 1:","DEU","durch ungültigen Sprachschlüssel ersetzen, wenn keine deutschen Texte übernommen werden sollen","Replace by an invalid language key if German descriptions are not wanted","Sprache 1:","DEU","durch ungültigen Sprachschlüssel ersetzen, wenn keine deutschen Texte übernommen werden sollen","Replace by an invalid language key if German descriptions are not wanted","Sprache 1:","DEU","durch ungültigen Sprachschlüssel ersetzen, wenn keine deutschen Texte übernommen werden sollen","Replace by an invalid language key if German descriptions are not wanted","Sprache 1:","DEU","durch ungültigen Sprachschlüssel ersetzen, wenn keine deutschen Texte übernommen werden sollen","Replace by an invalid language key if German descriptions are not wanted","Sprache 1:","DEU","durch ungültigen Sprachschlüssel ersetzen, wenn keine deutschen Texte übernommen werden sollen","Replace by an invalid language key if German descriptions are not wanted","Sprache 1:","DEU","durch ungültigen Sprachschlüssel ersetzen, wenn keine deutschen Texte übernommen werden sollen","Replace by an invalid language key if German descriptions are not wanted","Sprache 1:","DEU","durch ungültigen Sprachschlüssel ersetzen, wenn keine deutschen Texte übernommen werden sollen","Replace by an invalid language key if German descriptions are not wanted","Sprache 1:","DEU","durch ungültigen Sprachschlüssel ersetzen, wenn keine deutschen Texte übernommen werden sollen","Replace by an invalid language key if German descriptions are not wanted","Sprache 1:","DEU","durch ungültigen Sprachschlüssel ersetzen, wenn keine deutschen Texte übernommen werden sollen","Replace by an invalid language key if German descriptions are not wanted","Sprache 1:","DEU","durch ungültigen Sprachschlüssel ersetzen, wenn keine deutschen Texte übernommen werden sollen","Replace by an invalid language key if German descriptions are not wanted","Sprache 1:","DEU","durch ungültigen Sprachschlüssel ersetzen, wenn keine deutschen Texte übernommen werden sollen","Replace by an invalid language key if German descriptions are not wanted","Sprache 1:","DEU","durch ungültigen Sprachschlüssel ersetzen, wenn keine deutschen Texte übernommen werden sollen","Replace by an invalid language key if German descriptions are not wanted","Sprache 1:","DEU","durch ungültigen Sprachschlüssel ersetzen, wenn keine deutschen Texte übernommen werden sollen","Replace by an invalid language key if German descriptions are not wanted","Sprache 1:","DEU","durch ungültigen Sprachschlüssel ersetzen, wenn keine deutschen Texte übernommen werden sollen","Replace by an invalid language key if German descriptions are not wanted","Sprache 1:","DEU","durch ungültigen Sprachschlüssel ersetzen, wenn keine deutschen Texte übernommen werden sollen","Replace by an invalid language key if German descriptions are not wanted","Sprache 1:","DEU","durch ungültigen Sprachschlüssel ersetzen, wenn keine deutschen Texte übernommen werden sollen","Replace by an invalid language key if German descriptions are not wanted","Sprache 1:","DEU","durch ungültigen Sprachschlüssel ersetzen, wenn keine deutschen Texte übernommen werden sollen","Replace by an invalid language key if German descriptions are not wanted","Sprache 1:","DEU","durch ungültigen Sprachschlüssel ersetzen, wenn keine deutschen Texte übernommen werden sollen","Replace by an invalid language key if German descriptions are not wanted","Sprache 1:","DEU","durch ungültigen Sprachschlüssel ersetzen, wenn keine deutschen Texte übernommen werden sollen","Replace by an invalid language key if German descriptions are not wanted","Sprache 1:","DEU","durch ungültigen Sprachschlüssel ersetzen, wenn keine deutschen Texte übernommen werden sollen","Replace by an invalid language key if German descriptions are not wanted","Sprache 1:","DEU","durch ungültigen Sprachschlüssel ersetzen, wenn keine deutschen Texte übernommen werden sollen","Replace by an invalid language key if German descriptions are not wanted","Sprache 1:","DEU","durch ungültigen Sprachschlüssel ersetzen, wenn keine deutschen Texte übernommen werden sollen","Replace by an invalid language key if German descriptions are not wanted","Sprache 1:","DEU","durch ungültigen Sprachschlüssel ersetzen, wenn keine deutschen Texte übernommen werden sollen","Replace by an invalid language key if German descriptions are not wanted","Sprache 1:","DEU","durch ungültigen Sprachschlüssel ersetzen, wenn keine deutschen Texte übernommen werden sollen","Replace by an invalid language key if German descriptions are not wanted","Sprache 1:","DEU","durch ungültigen Sprachschlüssel ersetzen, wenn keine deutschen Texte übernommen werden sollen","Replace by an invalid language key if German descriptions are not wanted","Sprache 1:","DEU","durch ungültigen Sprachschlüssel ersetzen, wenn keine deutschen Texte übernommen werden sollen","Replace by an invalid language key if German descriptions are not wanted","Sprache 1:","DEU","durch ungültigen Sprachschlüssel ersetzen, wenn keine deutschen Texte übernommen werden sollen","Replace by an invalid language key if German descriptions are not wanted","Sprache 1:","DEU","durch ungültigen Sprachschlüssel ersetzen, wenn keine deutschen Texte übernommen werden sollen","Replace by an invalid language key if German descriptions are not wanted","Sprache 1:","DEU","durch ungültigen Sprachschlüssel ersetzen, wenn keine deutschen Texte übernommen werden sollen","Replace by an invalid language key if German descriptions are not wanted","Sprache 1:","DEU","durch ungültigen Sprachschlüssel ersetzen, wenn keine deutschen Texte übernommen werden sollen","Replace by an invalid language key if German descriptions are not wanted","Sprache 1:","DEU","durch ungültigen Sprachschlüssel ersetzen, wenn keine deutschen Texte übernommen werden sollen","Replace by an invalid language key if German descriptions are not wanted","Sprache 1:","DEU","durch ungültigen Sprachschlüssel ersetzen, wenn keine deutschen Texte übernommen werden sollen","Replace by an invalid language key if German descriptions are not wanted","Sprache 1:","DEU","durch ungültigen Sprachschlüssel ersetzen, wenn keine deutschen Texte übernommen werden sollen","Replace by an invalid language key if German descriptions are not wanted","Sprache 1:","DEU","durch ungültigen Sprachschlüssel ersetzen, wenn keine deutschen Texte übernommen werden sollen","Replace by an invalid language key if German descriptions are not wanted","Sprache 1:","DEU","durch ungültigen Sprachschlüssel ersetzen, wenn keine deutschen Texte übernommen werden sollen","Replace by an invalid language key if German descriptions are not wanted","Sprache 1:","DEU","durch ungültigen Sprachschlüssel ersetzen, wenn keine deutschen Texte übernommen werden sollen","Replace by an invalid language key if German descriptions are not wanted","Sprache 1:","DEU","durch ungültigen Sprachschlüssel ersetzen, wenn keine deutschen Texte übernommen werden sollen","Replace by an invalid language key if German descriptions are not wanted","Sprache 1:","DEU","durch ungültigen Sprachschlüssel ersetzen, wenn keine deutschen Texte übernommen werden sollen","Replace by an invalid language key if German descriptions are not wanted","Sprache 1:","DEU","durch ungültigen Sprachschlüssel ersetzen, wenn keine deutschen Texte übernommen werden sollen","Replace by an invalid language key if German descriptions are not wanted","Sprache 1:","DEU","durch ungültigen Sprachschlüssel ersetzen, wenn keine deutschen Texte übernommen werden sollen","Replace by an invalid language key if German descriptions are not wanted","Sprache 1:","DEU","durch ungültigen Sprachschlüssel ersetzen, wenn keine deutschen Texte übernommen werden sollen","Replace by an invalid language key if German descriptions are not wanted","Sprache 1:","DEU","durch ungültigen Sprachschlüssel ersetzen, wenn keine deutschen Texte übernommen werden sollen","Replace by an invalid language key if German descriptions are not wanted","Sprache 1:","DEU","durch ungültigen Sprachschlüssel ersetzen, wenn keine deutschen Texte übernommen werden sollen","Replace by an invalid language key if German descriptions are not wanted","Sprache 1:","DEU","durch ungültigen Sprachschlüssel ersetzen, wenn keine deutschen Texte übernommen werden sollen","Replace by an invalid language key if German descriptions are not wanted","Sprache 1:","DEU","durch ungültigen Sprachschlüssel ersetzen, wenn keine deutschen Texte übernommen werden sollen","Replace by an invalid language key if German descriptions are not wanted","Sprache 1:","DEU","durch ungültigen Sprachschlüssel ersetzen, wenn keine deutschen Texte übernommen werden sollen","Replace by an invalid language key if German descriptions are not wanted","Sprache 1:","DEU","durch ungültigen Sprachschlüssel ersetzen, wenn keine deutschen Texte übernommen werden sollen","Replace by an invalid language key if German descriptions are not wanted","Sprache 1:","DEU","durch ungültigen Sprachschlüssel ersetzen, wenn keine deutschen Texte übernommen werden sollen","Replace by an invalid language key if German descriptions are not wanted","Sprache 1:","DEU","durch ungültigen Sprachschlüssel ersetzen, wenn keine deutschen Texte übernommen werden sollen","Replace by an invalid language key if German descriptions are not wanted","Sprache 1:","DEU","durch ungültigen Sprachschlüssel ersetzen, wenn keine deutschen Texte übernommen werden sollen","Replace by an invalid language key if German descriptions are not wanted","Sprache 1:","DEU","durch ungültigen Sprachschlüssel ersetzen, wenn keine deutschen Texte übernommen werden sollen","Replace by an invalid language key if German descriptions are not wanted","Sprache 1:","DEU","durch ungültigen Sprachschlüssel ersetzen, wenn keine deutschen Texte übernommen werden sollen","Replace by an invalid language key if German descriptions are not wanted","Sprache 1:","DEU","durch ungültigen Sprachschlüssel ersetzen, wenn keine deutschen Texte übernommen werden sollen","Replace by an invalid language key if German descriptions are not wanted","Sprache 1:","DEU","durch ungültigen Sprachschlüssel ersetzen, wenn keine deutschen Texte übernommen werden sollen","Replace by an invalid language key if German descriptions are not wanted","Sprache 1:","DEU","durch ungültigen Sprachschlüssel ersetzen, wenn keine deutschen Texte übernommen werden sollen","Replace by an invalid language key if German descriptions are not wanted","Sprache 1:","DEU","durch ungültigen Sprachschlüssel ersetzen, wenn keine deutschen Texte übernommen werden sollen","Replace by an invalid language key if German descriptions are not wanted","Sprache 1:","DEU","durch ungültigen Sprachschlüssel ersetzen, wenn keine deutschen Texte übernommen werden sollen","Replace by an invalid language key if German descriptions are not wanted","Sprache 1:","DEU","durch ungültigen Sprachschlüssel ersetzen, wenn keine deutschen Texte übernommen werden sollen","Replace by an invalid language key if German descriptions are not wanted","Sprache 1:","DEU","durch ungültigen Sprachschlüssel ersetzen, wenn keine deutschen Texte übernommen werden sollen","Replace by an invalid language key if German descriptions are not wanted","Sprache 1:","DEU","durch ungültigen Sprachschlüssel ersetzen, wenn keine deutschen Texte übernommen werden sollen","Replace by an invalid language key if German descriptions are not wanted","Sprache 1:","DEU","durch ungültigen Sprachschlüssel ersetzen, wenn keine deutschen Texte übernommen werden sollen","Replace by an invalid language key if German descriptions are not wanted","Sprache 1:","DEU","durch ungültigen Sprachschlüssel ersetzen, wenn keine deutschen Texte übernommen werden sollen","Replace by an invalid language key if German descriptions are not wanted","Sprache 1:","DEU","durch ungültigen Sprachschlüssel ersetzen, wenn keine deutschen Texte übernommen werden sollen","Replace by an invalid language key if German descriptions are not wanted","Sprache 1:","DEU","durch ungültigen Sprachschlüssel ersetzen, wenn keine deutschen Texte übernommen werden sollen","Replace by an invalid language key if German descriptions are not wanted","Sprache 1:","DEU","durch ungültigen Sprachschlüssel ersetzen, wenn keine deutschen Texte übernommen werden sollen","Replace by an invalid language key if German descriptions are not wanted","Sprache 1:","DEU","durch ungültigen Sprachschlüssel ersetzen, wenn keine deutschen Texte übernommen werden sollen","Replace by an invalid language key if German descriptions are not wanted","Sprache 1:","DEU","durch ungültigen Sprachschlüssel ersetzen, wenn keine deutschen Texte übernommen werden sollen","Replace by an invalid language key if German descriptions are not wanted","Sprache 1:","DEU","durch ungültigen Sprachschlüssel ersetzen, wenn keine deutschen Texte übernommen werden sollen","Replace by an invalid language key if German descriptions are not wanted","Sprache 1:","DEU","durch ungültigen Sprachschlüssel ersetzen, wenn keine deutschen Texte übernommen werden sollen","Replace by an invalid language key if German descriptions are not wanted","Sprache 1:","DEU","durch ungültigen Sprachschlüssel ersetzen, wenn keine deutschen Texte übernommen werden sollen","Replace by an invalid language key if German descriptions are not wanted","Sprache 1:","DEU","durch ungültigen Sprachschlüssel ersetzen, wenn keine deutschen Texte übernommen werden sollen","Replace by an invalid language key if German descriptions are not wanted","Sprache 1:","DEU","durch ungültigen Sprachschlüssel ersetzen, wenn keine deutschen Texte übernommen werden sollen","Replace by an invalid language key if German descriptions are not wanted","Sprache 1:","DEU","durch ungültigen Sprachschlüssel ersetzen, wenn keine deutschen Texte übernommen werden sollen","Replace by an invalid language key if German descriptions are not wanted","Sprache 1:","DEU","durch ungültigen Sprachschlüssel ersetzen, wenn keine deutschen Texte übernommen werden sollen","Replace by an invalid language key if German descriptions are not wanted","Sprache 1:","DEU","durch ungültigen Sprachschlüssel ersetzen, wenn keine deutschen Texte übernommen werden sollen","Replace by an invalid language key if German descriptions are not wanted","Sprache 1:","DEU","durch ungültigen Sprachschlüssel ersetzen, wenn keine deutschen Texte übernommen werden sollen","Replace by an invalid language key if German descriptions are not wanted","Sprache 1:","DEU","durch ungültigen Sprachschlüssel ersetzen, wenn keine deutschen Texte übernommen werden sollen","Replace by an invalid language key if German descriptions are not wanted","Sprache 1:","DEU","durch ungültigen Sprachschlüssel ersetzen, wenn keine deutschen Texte übernommen werden sollen","Replace by an invalid language key if German descriptions are not wanted","Sprache 1:","DEU","durch ungültigen Sprachschlüssel ersetzen, wenn keine deutschen Texte übernommen werden sollen","Replace by an invalid language key if German descriptions are not wanted","Sprache 1:","DEU","durch ungültigen Sprachschlüssel ersetzen, wenn keine deutschen Texte übernommen werden sollen","Replace by an invalid language key if German descriptions are not wanted","Sprache 1:","DEU","durch ungültigen Sprachschlüssel ersetzen, wenn keine deutschen Texte übernommen werden sollen","Replace by an invalid language key if German descriptions are not wanted","Sprache 1:","DEU","durch ungültigen Sprachschlüssel ersetzen, wenn keine deutschen Texte übernommen werden sollen","Replace by an invalid language key if German descriptions are not wanted","Sprache 1:","DEU","durch ungültigen Sprachschlüssel ersetzen, wenn keine deutschen Texte übernommen werden sollen","Replace by an invalid language key if German descriptions are not wanted","Sprache 1:","DEU","durch ungültigen Sprachschlüssel ersetzen, wenn keine deutschen Texte übernommen werden sollen","Replace by an invalid language key if German descriptions are not wanted","Sprache 1:","DEU","durch ungültigen Sprachschlüssel ersetzen, wenn keine deutschen Texte übernommen werden sollen","Replace by an invalid language key if German descriptions are not wanted","Sprache 1:","DEU","durch ungültigen Sprachschlüssel ersetzen, wenn keine deutschen Texte übernommen werden sollen","Replace by an invalid language key if German descriptions are not wanted","Sprache 1:","DEU","durch ungültigen Sprachschlüssel ersetzen, wenn keine deutschen Texte übernommen werden sollen","Replace by an invalid language key if German descriptions are not wanted","Sprache 1:","DEU","durch ungültigen Sprachschlüssel ersetzen, wenn keine deutschen Texte übernommen werden sollen","Replace by an invalid language key if German descriptions are not wanted","Sprache 1:","DEU","durch ungültigen Sprachschlüssel ersetzen, wenn keine deutschen Texte übernommen werden sollen","Replace by an invalid language key if German descriptions are not wanted","Sprache 1:","DEU","durch ungültigen Sprachschlüssel ersetzen, wenn keine deutschen Texte übernommen werden sollen","Replace by an invalid language key if German descriptions are not wanted","Sprache 1:","DEU","durch ungültigen Sprachschlüssel ersetzen, wenn keine deutschen Texte übernommen werden sollen","Replace by an invalid language key if German descriptions are not wanted","Sprache 1:","DEU","durch ungültigen Sprachschlüssel ersetzen, wenn keine deutschen Texte übernommen werden sollen","Replace by an invalid language key if German descriptions are not wanted","Sprache 1:","DEU","durch ungültigen Sprachschlüssel ersetzen, wenn keine deutschen Texte übernommen werden sollen","Replace by an invalid language key if German descriptions are not wanted","Sprache 1:","DEU","durch ungültigen Sprachschlüssel ersetzen, wenn keine deutschen Texte übernommen werden sollen","Replace by an invalid language key if German descriptions are not wanted","Sprache 1:","DEU","durch ungültigen Sprachschlüssel ersetzen, wenn keine deutschen Texte übernommen werden sollen","Replace by an invalid language key if German descriptions are not wanted","Sprache 1:","DEU","durch ungültigen Sprachschlüssel ersetzen, wenn keine deutschen Texte übernommen werden sollen","Replace by an invalid language key if German descriptions are not wanted","Sprache 1:","DEU","durch ungültigen Sprachschlüssel ersetzen, wenn keine deutschen Texte übernommen werden sollen","Replace by an invalid language key if German descriptions are not wanted","Sprache 1:","DEU","durch ungültigen Sprachschlüssel ersetzen, wenn keine deutschen Texte übernommen werden sollen","Replace by an invalid language key if German descriptions are not wanted","Sprache 1:","DEU","durch ungültigen Sprachschlüssel ersetzen, wenn keine deutschen Texte übernommen werden sollen","Replace by an invalid language key if German descriptions are not wanted","Sprache 1:","DEU","durch ungültigen Sprachschlüssel ersetzen, wenn keine deutschen Texte übernommen werden sollen","Replace by an invalid language key if German descriptions are not wanted","Sprache 1:","DEU","durch ungültigen Sprachschlüssel ersetzen, wenn keine deutschen Texte übernommen werden sollen","Replace by an invalid language key if German descriptions are not wanted","Sprache 1:","DEU","durch ungültigen Sprachschlüssel ersetzen, wenn keine deutschen Texte übernommen werden sollen","Replace by an invalid language key if German descriptions are not wanted","Sprache 1:","DEU","durch ungültigen Sprachschlüssel ersetzen, wenn keine deutschen Texte übernommen werden sollen","Replace by an invalid language key if German descriptions are not wanted","Sprache 1:","DEU","durch ungültigen Sprachschlüssel ersetzen, wenn keine deutschen Texte übernommen werden sollen","Replace by an invalid language key if German descriptions are not wanted","Sprache 1:","DEU","durch ungültigen Sprachschlüssel ersetzen, wenn keine deutschen Texte übernommen werden sollen","Replace by an invalid language key if German descriptions are not wanted","Sprache 1:","DEU","durch ungültigen Sprachschlüssel ersetzen, wenn keine deutschen Texte übernommen werden sollen","Replace by an invalid language key if German descriptions are not wanted","Sprache 1:","DEU","durch ungültigen Sprachschlüssel ersetzen, wenn keine deutschen Texte übernommen werden sollen","Replace by an invalid language key if German descriptions are not wanted","Sprache 1:","DEU","durch ungültigen Sprachschlüssel ersetzen, wenn keine deutschen Texte übernommen werden sollen","Replace by an invalid language key if German descriptions are not wanted","Sprache 1:","DEU","durch ungültigen Sprachschlüssel ersetzen, wenn keine deutschen Texte übernommen werden sollen","Replace by an invalid language key if German descriptions are not wanted","Sprache 1:","DEU","durch ungültigen Sprachschlüssel ersetzen, wenn keine deutschen Texte übernommen werden sollen","Replace by an invalid language key if German descriptions are not wanted","Sprache 1:","DEU","durch ungültigen Sprachschlüssel ersetzen, wenn keine deutschen Texte übernommen werden sollen","Replace by an invalid language key if German descriptions are not wanted","Sprache 1:","DEU","durch ungültigen Sprachschlüssel ersetzen, wenn keine deutschen Texte übernommen werden sollen","Replace by an invalid language key if German descriptions are not wanted","Sprache 1:","DEU","durch ungültigen Sprachschlüssel ersetzen, wenn keine deutschen Texte übernommen werden sollen","Replace by an invalid language key if German descriptions are not wanted","Sprache 1:","DEU","durch ungültigen Sprachschlüssel ersetzen, wenn keine deutschen Texte übernommen werden sollen","Replace by an invalid language key if German descriptions are not wanted","Sprache 1:","DEU","durch ungültigen Sprachschlüssel ersetzen, wenn keine deutschen Texte übernommen werden sollen","Replace by an invalid language key if German descriptions are not wanted","Sprache 1:","DEU","durch ungültigen Sprachschlüssel ersetzen, wenn keine deutschen Texte übernommen werden sollen","Replace by an invalid language key if German descriptions are not wanted","Sprache 1:","DEU","durch ungültigen Sprachschlüssel ersetzen, wenn keine deutschen Texte übernommen werden sollen","Replace by an invalid language key if German descriptions are not wanted","Sprache 1:","DEU","durch ungültigen Sprachschlüssel ersetzen, wenn keine deutschen Texte übernommen werden sollen","Replace by an invalid language key if German descriptions are not wanted","Sprache 1:","DEU","durch ungültigen Sprachschlüssel ersetzen, wenn keine deutschen Texte übernommen werden sollen","Replace by an invalid language key if German descriptions are not wanted","Sprache 1:","DEU","durch ungültigen Sprachschlüssel ersetzen, wenn keine deutschen Texte übernommen werden sollen","Replace by an invalid language key if German descriptions are not wanted","Sprache 1:","DEU","durch ungültigen Sprachschlüssel ersetzen, wenn keine deutschen Texte übernommen werden sollen","Replace by an invalid language key if German descriptions are not wanted","Sprache 1:","DEU","durch ungültigen Sprachschlüssel ersetzen, wenn keine deutschen Texte übernommen werden sollen","Replace by an invalid language key if German descriptions are not wanted","Sprache 1:","DEU","durch ungültigen Sprachschlüssel ersetzen, wenn keine deutschen Texte übernommen werden sollen","Replace by an invalid language key if German descriptions are not wanted","Sprache 1:","DEU","durch ungültigen Sprachschlüssel ersetzen, wenn keine deutschen Texte übernommen werden sollen","Replace by an invalid language key if German descriptions are not wanted","Sprache 1:","DEU","durch ungültigen Sprachschlüssel ersetzen, wenn keine deutschen Texte übernommen werden sollen","Replace by an invalid language key if German descriptions are not wanted","Sprache 1:","DEU","durch ungültigen Sprachschlüssel ersetzen, wenn keine deutschen Texte übernommen werden sollen","Replace by an invalid language key if German descriptions are not wanted","Sprache 1:","DEU","durch ungültigen Sprachschlüssel ersetzen, wenn keine deutschen Texte übernommen werden sollen","Replace by an invalid language key if German descriptions are not wanted","Sprache 1:","DEU","durch ungültigen Sprachschlüssel ersetzen, wenn keine deutschen Texte übernommen werden sollen","Replace by an invalid language key if German descriptions are not wanted","Sprache 1:","DEU","durch ungültigen Sprachschlüssel ersetzen, wenn keine deutschen Texte übernommen werden sollen","Replace by an invalid language key if German descriptions are not wanted","Sprache 1:","DEU","durch ungültigen Sprachschlüssel ersetzen, wenn keine deutschen Texte übernommen werden sollen","Replace by an invalid language key if German descriptions are not wanted","Sprache 1:","DEU","durch ungültigen Sprachschlüssel ersetzen, wenn keine deutschen Texte übernommen werden sollen","Replace by an invalid language key if German descriptions are not wanted","Sprache 1:","DEU","durch ungültigen Sprachschlüssel ersetzen, wenn keine deutschen Texte übernommen werden sollen","Replace by an invalid language key if German descriptions are not wanted","Sprache 1:","DEU","durch ungültigen Sprachschlüssel ersetzen, wenn keine deutschen Texte übernommen werden sollen","Replace by an invalid language key if German descriptions are not wanted","Sprache 1:","DEU","durch ungültigen Sprachschlüssel ersetzen, wenn keine deutschen Texte übernommen werden sollen","Replace by an invalid language key if German descriptions are not wanted","Sprache 1:","DEU","durch ungültigen Sprachschlüssel ersetzen, wenn keine deutschen Texte übernommen werden sollen","Replace by an invalid language key if German descriptions are not wanted","Sprache 1:","DEU","durch ungültigen Sprachschlüssel ersetzen, wenn keine deutschen Texte übernommen werden sollen","Replace by an invalid language key if German descriptions are not wanted","Sprache 1:","DEU","durch ungültigen Sprachschlüssel ersetzen, wenn keine deutschen Texte übernommen werden sollen","Replace by an invalid language key if German descriptions are not wanted","Sprache 1:","DEU","durch ungültigen Sprachschlüssel ersetzen, wenn keine deutschen Texte übernommen werden sollen","Replace by an invalid language key if German descriptions are not wanted","Sprache 1:","DEU","durch ungültigen Sprachschlüssel ersetzen, wenn keine deutschen Texte übernommen werden sollen","Replace by an invalid language key if German descriptions are not wanted","Sprache 1:","DEU","durch ungültigen Sprachschlüssel ersetzen, wenn keine deutschen Texte übernommen werden sollen","Replace by an invalid language key if German descriptions are not wanted","Sprache 1:","DEU","durch ungültigen Sprachschlüssel ersetzen, wenn keine deutschen Texte übernommen werden sollen","Replace by an invalid language key if German descriptions are not wanted","Sprache 1:","DEU","durch ungültigen Sprachschlüssel ersetzen, wenn keine deutschen Texte übernommen werden sollen","Replace by an invalid language key if German descriptions are not wanted","Sprache 1:","DEU","durch ungültigen Sprachschlüssel ersetzen, wenn keine deutschen Texte übernommen werden sollen","Replace by an invalid language key if German descriptions are not wanted","Sprache 1:","DEU","durch ungültigen Sprachschlüssel ersetzen, wenn keine deutschen Texte übernommen werden sollen","Replace by an invalid language key if German descriptions are not wanted","Sprache 1:","DEU","durch ungültigen Sprachschlüssel ersetzen, wenn keine deutschen Texte übernommen werden sollen","Replace by an invalid language key if German descriptions are not wanted","Sprache 1:","DEU","durch ungültigen Sprachschlüssel ersetzen, wenn keine deutschen Texte übernommen werden sollen","Replace by an invalid language key if German descriptions are not wanted","Sprache 1:","DEU","durch ungültigen Sprachschlüssel ersetzen, wenn keine deutschen Texte übernommen werden sollen","Replace by an invalid language key if German descriptions are not wanted","Sprache 1:","DEU","durch ungültigen Sprachschlüssel ersetzen, wenn keine deutschen Texte übernommen werden sollen","Replace by an invalid language key if German descriptions are not wanted","Sprache 1:","DEU","durch ungültigen Sprachschlüssel ersetzen, wenn keine deutschen Texte übernommen werden sollen","Replace by an invalid language key if German descriptions are not wanted","Sprache 1:","DEU","durch ungültigen Sprachschlüssel ersetzen, wenn keine deutschen Texte übernommen werden sollen","Replace by an invalid language key if German descriptions are not wanted","Sprache 1:","DEU","durch ungültigen Sprachschlüssel ersetzen, wenn keine deutschen Texte übernommen werden sollen","Replace by an invalid language key if German descriptions are not wanted","Sprache 1:","DEU","durch ungültigen Sprachschlüssel ersetzen, wenn keine deutschen Texte übernommen werden sollen","Replace by an invalid language key if German descriptions are not wanted","Sprache 1:","DEU","durch ungültigen Sprachschlüssel ersetzen, wenn keine deutschen Texte übernommen werden sollen","Replace by an invalid language key if German descriptions are not wanted","Sprache 1:","DEU","durch ungültigen Sprachschlüssel ersetzen, wenn keine deutschen Texte übernommen werden sollen","Replace by an invalid language key if German descriptions are not wanted","Sprache 1:","DEU","durch ungültigen Sprachschlüssel ersetzen, wenn keine deutschen Texte übernommen werden sollen","Replace by an invalid language key if German descriptions are not wanted","Sprache 1:","DEU","durch ungültigen Sprachschlüssel ersetzen, wenn keine deutschen Texte übernommen werden sollen","Replace by an invalid language key if German descriptions are not wanted","Sprache 1:","DEU","durch ungültigen Sprachschlüssel ersetzen, wenn keine deutschen Texte übernommen werden sollen","Replace by an invalid language key if German descriptions are not wanted","Sprache 1:","DEU","durch ungültigen Sprachschlüssel ersetzen, wenn keine deutschen Texte übernommen werden sollen","Replace by an invalid language key if German descriptions are not wanted","Sprache 1:","DEU","durch ungültigen Sprachschlüssel ersetzen, wenn keine deutschen Texte übernommen werden sollen","Replace by an invalid language key if German descriptions are not wanted","Sprache 1:","DEU","durch ungültigen Sprachschlüssel ersetzen, wenn keine deutschen Texte übernommen werden sollen","Replace by an invalid language key if German descriptions are not wanted","Sprache 1:","DEU","durch ungültigen Sprachschlüssel ersetzen, wenn keine deutschen Texte übernommen werden sollen","Replace by an invalid language key if German descriptions are not wanted","Sprache 1:","DEU","durch ungültigen Sprachschlüssel ersetzen, wenn keine deutschen Texte übernommen werden sollen","Replace by an invalid language key if German descriptions are not wanted","Sprache 1:","DEU","durch ungültigen Sprachschlüssel ersetzen, wenn keine deutschen Texte übernommen werden sollen","Replace by an invalid language key if German descriptions are not wanted","Sprache 1:","DEU","durch ungültigen Sprachschlüssel ersetzen, wenn keine deutschen Texte übernommen werden sollen","Replace by an invalid language key if German descriptions are not wanted","Sprache 1:","DEU","durch ungültigen Sprachschlüssel ersetzen, wenn keine deutschen Texte übernommen werden sollen","Replace by an invalid language key if German descriptions are not wanted","Sprache 1:","DEU","durch ungültigen Sprachschlüssel ersetzen, wenn keine deutschen Texte übernommen werden sollen","Replace by an invalid language key if German descriptions are not wanted","Sprache 1:","DEU","durch ungültigen Sprachschlüssel ersetzen, wenn keine deutschen Texte übernommen werden sollen","Replace by an invalid language key if German descriptions are not wanted","Sprache 1:","DEU","durch ungültigen Sprachschlüssel ersetzen, wenn keine deutschen Texte übernommen werden sollen","Replace by an invalid language key if German descriptions are not wanted","Sprache 1:","DEU","durch ungültigen Sprachschlüssel ersetzen, wenn keine deutschen Texte übernommen werden sollen","Replace by an invalid language key if German descriptions are not wanted","Sprache 1:","DEU","durch ungültigen Sprachschlüssel ersetzen, wenn keine deutschen Texte übernommen werden sollen","Replace by an invalid language key if German descriptions are not wanted","Sprache 1:","DEU","durch ungültigen Sprachschlüssel ersetzen, wenn keine deutschen Texte übernommen werden sollen","Replace by an invalid language key if German descriptions are not wanted","Sprache 1:","DEU","durch ungültigen Sprachschlüssel ersetzen, wenn keine deutschen Texte übernommen werden sollen","Replace by an invalid language key if German descriptions are not wanted","Sprache 1:","DEU","durch ungültigen Sprachschlüssel ersetzen, wenn keine deutschen Texte übernommen werden sollen","Replace by an invalid language key if German descriptions are not wanted","Sprache 1:","DEU","durch ungültigen Sprachschlüssel ersetzen, wenn keine deutschen Texte übernommen werden sollen","Replace by an invalid language key if German descriptions are not wanted","Sprache 1:","DEU","durch ungültigen Sprachschlüssel ersetzen, wenn keine deutschen Texte übernommen werden sollen","Replace by an invalid language key if German descriptions are not wanted","Sprache 1:","DEU","durch ungültigen Sprachschlüssel ersetzen, wenn keine deutschen Texte übernommen werden sollen","Replace by an invalid language key if German descriptions are not wanted","Sprache 1:","DEU","durch ungültigen Sprachschlüssel ersetzen, wenn keine deutschen Texte übernommen werden sollen","Replace by an invalid language key if German descriptions are not wanted","Sprache 1:","DEU","durch ungültigen Sprachschlüssel ersetzen, wenn keine deutschen Texte übernommen werden sollen","Replace by an invalid language key if German descriptions are not wanted","Sprache 1:","DEU","durch ungültigen Sprachschlüssel ersetzen, wenn keine deutschen Texte übernommen werden sollen","Replace by an invalid language key if German descriptions are not wanted","Sprache 1:","DEU","durch ungültigen Sprachschlüssel ersetzen, wenn keine deutschen Texte übernommen werden sollen","Replace by an invalid language key if German descriptions are not wanted","Sprache 1:","DEU","durch ungültigen Sprachschlüssel ersetzen, wenn keine deutschen Texte übernommen werden sollen","Replace by an invalid language key if German descriptions are not wanted","Sprache 1:","DEU","durch ungültigen Sprachschlüssel ersetzen, wenn keine deutschen Texte übernommen werden sollen","Replace by an invalid language key if German descriptions are not wanted","Sprache 1:","DEU","durch ungültigen Sprachschlüssel ersetzen, wenn keine deutschen Texte übernommen werden sollen","Replace by an invalid language key if German descriptions are not wanted","Sprache 1:","DEU","durch ungültigen Sprachschlüssel ersetzen, wenn keine deutschen Texte übernommen werden sollen","Replace by an invalid language key if German descriptions are not wanted","Sprache 1:","DEU","durch ungültigen Sprachschlüssel ersetzen, wenn keine deutschen Texte übernommen werden sollen","Replace by an invalid language key if German descriptions are not wanted","Sprache 1:","DEU","durch ungültigen Sprachschlüssel ersetzen, wenn keine deutschen Texte übernommen werden sollen","Replace by an invalid language key if German descriptions are not wanted","Sprache 1:","DEU","durch ungültigen Sprachschlüssel ersetzen, wenn keine deutschen Texte übernommen werden sollen","Replace by an invalid language key if German descriptions are not wanted","Sprache 1:","DEU","durch ungültigen Sprachschlüssel ersetzen, wenn keine deutschen Texte übernommen werden sollen","Replace by an invalid language key if German descriptions are not wanted","Sprache 1:","DEU","durch ungültigen Sprachschlüssel ersetzen, wenn keine deutschen Texte übernommen werden sollen","Replace by an invalid language key if German descriptions are not wanted","Sprache 1:","DEU","durch ungültigen Sprachschlüssel ersetzen, wenn keine deutschen Texte übernommen werden sollen","Replace by an invalid language key if German descriptions are not wanted","Sprache 1:","DEU","durch ungültigen Sprachschlüssel ersetzen, wenn keine deutschen Texte übernommen werden sollen","Replace by an invalid language key if German descriptions are not wanted","Sprache 1:","DEU","durch ungültigen Sprachschlüssel ersetzen, wenn keine deutschen Texte übernommen werden sollen","Replace by an invalid language key if German descriptions are not wanted","Sprache 1:","DEU","durch ungültigen Sprachschlüssel ersetzen, wenn keine deutschen Texte übernommen werden sollen","Replace by an invalid language key if German descriptions are not wanted","Sprache 1:","DEU","durch ungültigen Sprachschlüssel ersetzen, wenn keine deutschen Texte übernommen werden sollen","Replace by an invalid language key if German descriptions are not wanted","Sprache 1:","DEU","durch ungültigen Sprachschlüssel ersetzen, wenn keine deutschen Texte übernommen werden sollen","Replace by an invalid language key if German descriptions are not wanted","Sprache 1:","DEU","durch ungültigen Sprachschlüssel ersetzen, wenn keine deutschen Texte übernommen werden sollen","Replace by an invalid language key if German descriptions are not wanted","Sprache 1:","DEU","durch ungültigen Sprachschlüssel ersetzen, wenn keine deutschen Texte übernommen werden sollen","Replace by an invalid language key if German descriptions are not wanted","Sprache 1:","DEU","durch ungültigen Sprachschlüssel ersetzen, wenn keine deutschen Texte übernommen werden sollen","Replace by an invalid language key if German descriptions are not wanted","Sprache 1:","DEU","durch ungültigen Sprachschlüssel ersetzen, wenn keine deutschen Texte übernommen werden sollen","Replace by an invalid language key if German descriptions are not wanted","Sprache 1:","DEU","durch ungültigen Sprachschlüssel ersetzen, wenn keine deutschen Texte übernommen werden sollen","Replace by an invalid language key if German descriptions are not wanted","Sprache 1:","DEU","durch ungültigen Sprachschlüssel ersetzen, wenn keine deutschen Texte übernommen werden sollen","Replace by an invalid language key if German descriptions are not wanted","Sprache 1:","DEU","durch ungültigen Sprachschlüssel ersetzen, wenn keine deutschen Texte übernommen werden sollen","Replace by an invalid language key if German descriptions are not wanted","Sprache 1:","DEU","durch ungültigen Sprachschlüssel ersetzen, wenn keine deutschen Texte übernommen werden sollen","Replace by an invalid language key if German descriptions are not wanted","Sprache 1:","DEU","durch ungültigen Sprachschlüssel ersetzen, wenn keine deutschen Texte übernommen werden sollen","Replace by an invalid language key if German descriptions are not wanted","Sprache 1:","DEU","durch ungültigen Sprachschlüssel ersetzen, wenn keine deutschen Texte übernommen werden sollen","Replace by an invalid language key if German descriptions are not wanted","Sprache 1:","DEU","durch ungültigen Sprachschlüssel ersetzen, wenn keine deutschen Texte übernommen werden sollen","Replace by an invalid language key if German descriptions are not wanted","Sprache 1:","DEU","durch ungültigen Sprachschlüssel ersetzen, wenn keine deutschen Texte übernommen werden sollen","Replace by an invalid language key if German descriptions are not wanted","Sprache 1:","DEU","durch ungültigen Sprachschlüssel ersetzen, wenn keine deutschen Texte übernommen werden sollen","Replace by an invalid language key if German descriptions are not wanted","Sprache 1:","DEU","durch ungültigen Sprachschlüssel ersetzen, wenn keine deutschen Texte übernommen werden sollen","Replace by an invalid language key if German descriptions are not wanted","Sprache 1:","DEU","durch ungültigen Sprachschlüssel ersetzen, wenn keine deutschen Texte übernommen werden sollen","Replace by an invalid language key if German descriptions are not wanted","Sprache 1:","DEU","durch ungültigen Sprachschlüssel ersetzen, wenn keine deutschen Texte übernommen werden sollen","Replace by an invalid language key if German descriptions are not wanted","Sprache 1:","DEU","durch ungültigen Sprachschlüssel ersetzen, wenn keine deutschen Texte übernommen werden sollen","Replace by an invalid language key if German descriptions are not wanted","Sprache 1:","DEU","durch ungültigen Sprachschlüssel ersetzen, wenn keine deutschen Texte übernommen werden sollen","Replace by an invalid language key if German descriptions are not wanted","Sprache 1:","DEU","durch ungültigen Sprachschlüssel ersetzen, wenn keine deutschen Texte übernommen werden sollen","Replace by an invalid language key if German descriptions are not wanted","Sprache 1:","DEU","durch ungültigen Sprachschlüssel ersetzen, wenn keine deutschen Texte übernommen werden sollen","Replace by an invalid language key if German descriptions are not wanted","Sprache 1:","DEU","durch ungültigen Sprachschlüssel ersetzen, wenn keine deutschen Texte übernommen werden sollen","Replace by an invalid language key if German descriptions are not wanted","Sprache 1:","DEU","durch ungültigen Sprachschlüssel ersetzen, wenn keine deutschen Texte übernommen werden sollen","Replace by an invalid language key if German descriptions are not wanted","Sprache 1:","DEU","durch ungültigen Sprachschlüssel ersetzen, wenn keine deutschen Texte übernommen werden sollen","Replace by an invalid language key if German descriptions are not wanted","Sprache 1:","DEU","durch ungültigen Sprachschlüssel ersetzen, wenn keine deutschen Texte übernommen werden sollen","Replace by an invalid language key if German descriptions are not wanted","Sprache 1:","DEU","durch ungültigen Sprachschlüssel ersetzen, wenn keine deutschen Texte übernommen werden sollen","Replace by an invalid language key if German descriptions are not wanted","Sprache 1:","DEU","durch ungültigen Sprachschlüssel ersetzen, wenn keine deutschen Texte übernommen werden sollen","Replace by an invalid language key if German descriptions are not wanted","Sprache 1:","DEU","durch ungültigen Sprachschlüssel ersetzen, wenn keine deutschen Texte übernommen werden sollen","Replace by an invalid language key if German descriptions are not wanted","Sprache 1:","DEU","durch ungültigen Sprachschlüssel ersetzen, wenn keine deutschen Texte übernommen werden sollen","Replace by an invalid language key if German descriptions are not wanted","Sprache 1:","DEU","durch ungültigen Sprachschlüssel ersetzen, wenn keine deutschen Texte übernommen werden sollen","Replace by an invalid language key if German descriptions are not wanted","Sprache 1:","DEU","durch ungültigen Sprachschlüssel ersetzen, wenn keine deutschen Texte übernommen werden sollen","Replace by an invalid language key if German descriptions are not wanted","Sprache 1:","DEU","durch ungültigen Sprachschlüssel ersetzen, wenn keine deutschen Texte übernommen werden sollen","Replace by an invalid language key if German descriptions are not wanted","Sprache 1:","DEU","durch ungültigen Sprachschlüssel ersetzen, wenn keine deutschen Texte übernommen werden sollen","Replace by an invalid language key if German descriptions are not wanted","Sprache 1:","DEU","durch ungültigen Sprachschlüssel ersetzen, wenn keine deutschen Texte übernommen werden sollen","Replace by an invalid language key if German descriptions are not wanted","Sprache 1:","DEU","durch ungültigen Sprachschlüssel ersetzen, wenn keine deutschen Texte übernommen werden sollen","Replace by an invalid language key if German descriptions are not wanted","Sprache 1:","DEU","durch ungültigen Sprachschlüssel ersetzen, wenn keine deutschen Texte übernommen werden sollen","Replace by an invalid language key if German descriptions are not wanted","Sprache 1:","DEU","durch ungültigen Sprachschlüssel ersetzen, wenn keine deutschen Texte übernommen werden sollen","Replace by an invalid language key if German descriptions are not wanted","Sprache 1:","DEU","durch ungültigen Sprachschlüssel ersetzen, wenn keine deutschen Texte übernommen werden sollen","Replace by an invalid language key if German descriptions are not wanted","Sprache 1:","DEU","durch ungültigen Sprachschlüssel ersetzen, wenn keine deutschen Texte übernommen werden sollen","Replace by an invalid language key if German descriptions are not wanted","Sprache 1:","DEU","durch ungültigen Sprachschlüssel ersetzen, wenn keine deutschen Texte übernommen werden sollen","Replace by an invalid language key if German descriptions are not wanted","Sprache 1:","DEU","durch ungültigen Sprachschlüssel ersetzen, wenn keine deutschen Texte übernommen werden sollen","Replace by an invalid language key if German descriptions are not wanted","Sprache 1:","DEU","durch ungültigen Sprachschlüssel ersetzen, wenn keine deutschen Texte übernommen werden sollen","Replace by an invalid language key if German descriptions are not wanted","Sprache 1:","DEU","durch ungültigen Sprachschlüssel ersetzen, wenn keine deutschen Texte übernommen werden sollen","Replace by an invalid language key if German descriptions are not wanted","Sprache 1:","DEU","durch ungültigen Sprachschlüssel ersetzen, wenn keine deutschen Texte übernommen werden sollen","Replace by an invalid language key if German descriptions are not wanted","Sprache 1:","DEU","durch ungültigen Sprachschlüssel ersetzen, wenn keine deutschen Texte übernommen werden sollen","Replace by an invalid language key if German descriptions are not wanted","Sprache 1:","DEU","durch ungültigen Sprachschlüssel ersetzen, wenn keine deutschen Texte übernommen werden sollen","Replace by an invalid language key if German descriptions are not wanted","Sprache 1:","DEU","durch ungültigen Sprachschlüssel ersetzen, wenn keine deutschen Texte übernommen werden sollen","Replace by an invalid language key if German descriptions are not wanted","Sprache 1:","DEU","durch ungültigen Sprachschlüssel ersetzen, wenn keine deutschen Texte übernommen werden sollen","Replace by an invalid language key if German descriptions are not wanted","Sprache 1:","DEU","durch ungültigen Sprachschlüssel ersetzen, wenn keine deutschen Texte übernommen werden sollen","Replace by an invalid language key if German descriptions are not wanted","Sprache 1:","DEU","durch ungültigen Sprachschlüssel ersetzen, wenn keine deutschen Texte übernommen werden sollen","Replace by an invalid language key if German descriptions are not wanted","Sprache 1:","DEU","durch ungültigen Sprachschlüssel ersetzen, wenn keine deutschen Texte übernommen werden sollen","Replace by an invalid language key if German descriptions are not wanted","Sprache 1:","DEU","durch ungültigen Sprachschlüssel ersetzen, wenn keine deutschen Texte übernommen werden sollen","Replace by an invalid language key if German descriptions are not wanted","Sprache 1:","DEU","durch ungültigen Sprachschlüssel ersetzen, wenn keine deutschen Texte übernommen werden sollen","Replace by an invalid language key if German descriptions are not wanted","Sprache 1:","DEU","durch ungültigen Sprachschlüssel ersetzen, wenn keine deutschen Texte übernommen werden sollen","Replace by an invalid language key if German descriptions are not wanted","Sprache 1:","DEU","durch ungültigen Sprachschlüssel ersetzen, wenn keine deutschen Texte übernommen werden sollen","Replace by an invalid language key if German descriptions are not wanted","Sprache 1:","DEU","durch ungültigen Sprachschlüssel ersetzen, wenn keine deutschen Texte übernommen werden sollen","Replace by an invalid language key if German descriptions are not wanted","Sprache 1:","DEU","durch ungültigen Sprachschlüssel ersetzen, wenn keine deutschen Texte übernommen werden sollen","Replace by an invalid language key if German descriptions are not wanted","Sprache 1:","DEU","durch ungültigen Sprachschlüssel ersetzen, wenn keine deutschen Texte übernommen werden sollen","Replace by an invalid language key if German descriptions are not wanted","Sprache 1:","DEU","durch ungültigen Sprachschlüssel ersetzen, wenn keine deutschen Texte übernommen werden sollen","Replace by an invalid language key if German descriptions are not wanted","Sprache 1:","DEU","durch ungültigen Sprachschlüssel ersetzen, wenn keine deutschen Texte übernommen werden sollen","Replace by an invalid language key if German descriptions are not wanted","Sprache 1:","DEU","durch ungültigen Sprachschlüssel ersetzen, wenn keine deutschen Texte übernommen werden sollen","Replace by an invalid language key if German descriptions are not wanted","Sprache 1:","DEU","durch ungültigen Sprachschlüssel ersetzen, wenn keine deutschen Texte übernommen werden sollen","Replace by an invalid language key if German descriptions are not wanted","Sprache 1:","DEU","durch ungültigen Sprachschlüssel ersetzen, wenn keine deutschen Texte übernommen werden sollen","Replace by an invalid language key if German descriptions are not wanted","Sprache 1:","DEU","durch ungültigen Sprachschlüssel ersetzen, wenn keine deutschen Texte übernommen werden sollen","Replace by an invalid language key if German descriptions are not wanted","Sprache 1:","DEU","durch ungültigen Sprachschlüssel ersetzen, wenn keine deutschen Texte übernommen werden sollen","Replace by an invalid language key if German descriptions are not wanted","Sprache 1:","DEU","durch ungültigen Sprachschlüssel ersetzen, wenn keine deutschen Texte übernommen werden sollen","Replace by an invalid language key if German descriptions are not wanted","Sprache 1:","DEU","durch ungültigen Sprachschlüssel ersetzen, wenn keine deutschen Texte übernommen werden sollen","Replace by an invalid language key if German descriptions are not wanted","Sprache 1:","DEU","durch ungültigen Sprachschlüssel ersetzen, wenn keine deutschen Texte übernommen werden sollen","Replace by an invalid language key if German descriptions are not wanted","Sprache 1:","DEU","durch ungültigen Sprachschlüssel ersetzen, wenn keine deutschen Texte übernommen werden sollen","Replace by an invalid language key if German descriptions are not wanted","Sprache 1:","DEU","durch ungültigen Sprachschlüssel ersetzen, wenn keine deutschen Texte übernommen werden sollen","Replace by an invalid language key if German descriptions are not wanted","Sprache 1:","DEU","durch ungültigen Sprachschlüssel ersetzen, wenn keine deutschen Texte übernommen werden sollen","Replace by an invalid language key if German descriptions are not wanted","Sprache 1:","DEU","durch ungültigen Sprachschlüssel ersetzen, wenn keine deutschen Texte übernommen werden sollen","Replace by an invalid language key if German descriptions are not wanted","Sprache 1:","DEU","durch ungültigen Sprachschlüssel ersetzen, wenn keine deutschen Texte übernommen werden sollen","Replace by an invalid language key if German descriptions are not wanted","Sprache 1:","DEU","durch ungültigen Sprachschlüssel ersetzen, wenn keine deutschen Texte übernommen werden sollen","Replace by an invalid language key if German descriptions are not wanted","Sprache 1:","DEU","durch ungültigen Sprachschlüssel ersetzen, wenn keine deutschen Texte übernommen werden sollen","Replace by an invalid language key if German descriptions are not wanted","Sprache 1:","DEU","durch ungültigen Sprachschlüssel ersetzen, wenn keine deutschen Texte übernommen werden sollen","Replace by an invalid language key if German descriptions are not wanted","Sprache 1:","DEU","durch ungültigen Sprachschlüssel ersetzen, wenn keine deutschen Texte übernommen werden sollen","Replace by an invalid language key if German descriptions are not wanted","Sprache 1:","DEU","durch ungültigen Sprachschlüssel ersetzen, wenn keine deutschen Texte übernommen werden sollen","Replace by an invalid language key if German descriptions are not wanted","Sprache 1:","DEU","durch ungültigen Sprachschlüssel ersetzen, wenn keine deutschen Texte übernommen werden sollen","Replace by an invalid language key if German descriptions are not wanted","Sprache 1:","DEU","durch ungültigen Sprachschlüssel ersetzen, wenn keine deutschen Texte übernommen werden sollen","Replace by an invalid language key if German descriptions are not wanted","Sprache 1:","DEU","durch ungültigen Sprachschlüssel ersetzen, wenn keine deutschen Texte übernommen werden sollen","Replace by an invalid language key if German descriptions are not wanted","Sprache 1:","DEU","durch ungültigen Sprachschlüssel ersetzen, wenn keine deutschen Texte übernommen werden sollen","Replace by an invalid language key if German descriptions are not wanted","Sprache 1:","DEU","durch ungültigen Sprachschlüssel ersetzen, wenn keine deutschen Texte übernommen werden sollen","Replace by an invalid language key if German descriptions are not wanted","Sprache 1:","DEU","durch ungültigen Sprachschlüssel ersetzen, wenn keine deutschen Texte übernommen werden sollen","Replace by an invalid language key if German descriptions are not wanted","Sprache 1:","DEU","durch ungültigen Sprachschlüssel ersetzen, wenn keine deutschen Texte übernommen werden sollen","Replace by an invalid language key if German descriptions are not wanted","Sprache 1:","DEU","durch ungültigen Sprachschlüssel ersetzen, wenn keine deutschen Texte übernommen werden sollen","Replace by an invalid language key if German descriptions are not wanted","Sprache 1:","DEU","durch ungültigen Sprachschlüssel ersetzen, wenn keine deutschen Texte übernommen werden sollen","Replace by an invalid language key if German descriptions are not wanted","Sprache 1:","DEU","durch ungültigen Sprachschlüssel ersetzen, wenn keine deutschen Texte übernommen werden sollen","Replace by an invalid language key if German descriptions are not wanted","Sprache 1:","DEU","durch ungültigen Sprachschlüssel ersetzen, wenn keine deutschen Texte übernommen werden sollen","Replace by an invalid language key if German descriptions are not wanted","Sprache 1:","DEU","durch ungültigen Sprachschlüssel ersetzen, wenn keine deutschen Texte übernommen werden sollen","Replace by an invalid language key if German descriptions are not wanted","Sprache 1:","DEU","durch ungültigen Sprachschlüssel ersetzen, wenn keine deutschen Texte übernommen werden sollen","Replace by an invalid language key if German descriptions are not wanted","Sprache 1:","DEU","durch ungültigen Sprachschlüssel ersetzen, wenn keine deutschen Texte übernommen werden sollen","Replace by an invalid language key if German descriptions are not wanted","Sprache 1:","DEU","durch ungültigen Sprachschlüssel ersetzen, wenn keine deutschen Texte übernommen werden sollen","Replace by an invalid language key if German descriptions are not wanted","Sprache 1:","DEU","durch ungültigen Sprachschlüssel ersetzen, wenn keine deutschen Texte übernommen werden sollen","Replace by an invalid language key if German descriptions are not wanted","Sprache 1:","DEU","durch ungültigen Sprachschlüssel ersetzen, wenn keine deutschen Texte übernommen werden sollen","Replace by an invalid language key if German descriptions are not wanted","Sprache 1:","DEU","durch ungültigen Sprachschlüssel ersetzen, wenn keine deutschen Texte übernommen werden sollen","Replace by an invalid language key if German descriptions are not wanted","Sprache 1:","DEU","durch ungültigen Sprachschlüssel ersetzen, wenn keine deutschen Texte übernommen werden sollen","Replace by an invalid language key if German descriptions are not wanted","Sprache 1:","DEU","durch ungültigen Sprachschlüssel ersetzen, wenn keine deutschen Texte übernommen werden sollen","Replace by an invalid language key if German descriptions are not wanted","Sprache 1:","DEU","durch ungültigen Sprachschlüssel ersetzen, wenn keine deutschen Texte übernommen werden sollen","Replace by an invalid language key if German descriptions are not wanted","Sprache 1:","DEU","durch ungültigen Sprachschlüssel ersetzen, wenn keine deutschen Texte übernommen werden sollen","Replace by an invalid language key if German descriptions are not wanted","Sprache 1:","DEU","durch ungültigen Sprachschlüssel ersetzen, wenn keine deutschen Texte übernommen werden sollen","Replace by an invalid language key if German descriptions are not wanted","Sprache 1:","DEU","durch ungültigen Sprachschlüssel ersetzen, wenn keine deutschen Texte übernommen werden sollen","Replace by an invalid language key if German descriptions are not wanted","Sprache 1:","DEU","durch ungültigen Sprachschlüssel ersetzen, wenn keine deutschen Texte übernommen werden sollen","Replace by an invalid language key if German descriptions are not wanted","Sprache 1:","DEU","durch ungültigen Sprachschlüssel ersetzen, wenn keine deutschen Texte übernommen werden sollen","Replace by an invalid language key if German descriptions are not wanted","Sprache 1:","DEU","durch ungültigen Sprachschlüssel ersetzen, wenn keine deutschen Texte übernommen werden sollen","Replace by an invalid language key if German descriptions are not wanted","Sprache 1:","DEU","durch ungültigen Sprachschlüssel ersetzen, wenn keine deutschen Texte übernommen werden sollen","Replace by an invalid language key if German descriptions are not wanted","Sprache 1:","DEU","durch ungültigen Sprachschlüssel ersetzen, wenn keine deutschen Texte übernommen werden sollen","Replace by an invalid language key if German descriptions are not wanted","Sprache 1:","DEU","durch ungültigen Sprachschlüssel ersetzen, wenn keine deutschen Texte übernommen werden sollen","Replace by an invalid language key if German descriptions are not wanted","Sprache 1:","DEU","durch ungültigen Sprachschlüssel ersetzen, wenn keine deutschen Texte übernommen werden sollen","Replace by an invalid language key if German descriptions are not wanted","Sprache 1:","DEU","durch ungültigen Sprachschlüssel ersetzen, wenn keine deutschen Texte übernommen werden sollen","Replace by an invalid language key if German descriptions are not wanted","Sprache 1:","DEU","durch ungültigen Sprachschlüssel ersetzen, wenn keine deutschen Texte übernommen werden sollen","Replace by an invalid language key if German descriptions are not wanted","Sprache 1:","DEU","durch ungültigen Sprachschlüssel ersetzen, wenn keine deutschen Texte übernommen werden sollen","Replace by an invalid language key if German descriptions are not wanted","Sprache 1:","DEU","durch ungültigen Sprachschlüssel ersetzen, wenn keine deutschen Texte übernommen werden sollen","Replace by an invalid language key if German descriptions are not wanted","Sprache 1:","DEU","durch ungültigen Sprachschlüssel ersetzen, wenn keine deutschen Texte übernommen werden sollen","Replace by an invalid language key if German descriptions are not wanted","Sprache 1:","DEU","durch ungültigen Sprachschlüssel ersetzen, wenn keine deutschen Texte übernommen werden sollen","Replace by an invalid language key if German descriptions are not wanted","Sprache 1:","DEU","durch ungültigen Sprachschlüssel ersetzen, wenn keine deutschen Texte übernommen werden sollen","Replace by an invalid language key if German descriptions are not wanted","Sprache 1:","DEU","durch ungültigen Sprachschlüssel ersetzen, wenn keine deutschen Texte übernommen werden sollen","Replace by an invalid language key if German descriptions are not wanted","Sprache 1:","DEU","durch ungültigen Sprachschlüssel ersetzen, wenn keine deutschen Texte übernommen werden sollen","Replace by an invalid language key if German descriptions are not wanted","Sprache 1:","DEU","durch ungültigen Sprachschlüssel ersetzen, wenn keine deutschen Texte übernommen werden sollen","Replace by an invalid language key if German descriptions are not wanted","Sprache 1:","DEU","durch ungültigen Sprachschlüssel ersetzen, wenn keine deutschen Texte übernommen werden sollen","Replace by an invalid language key if German descriptions are not wanted","Sprache 1:","DEU","durch ungültigen Sprachschlüssel ersetzen, wenn keine deutschen Texte übernommen werden sollen","Replace by an invalid language key if German descriptions are not wanted","Sprache 1:","DEU","durch ungültigen Sprachschlüssel ersetzen, wenn keine deutschen Texte übernommen werden sollen","Replace by an invalid language key if German descriptions are not wanted","Sprache 1:","DEU","durch ungültigen Sprachschlüssel ersetzen, wenn keine deutschen Texte übernommen werden sollen","Replace by an invalid language key if German descriptions are not wanted","Sprache 1:","DEU","durch ungültigen Sprachschlüssel ersetzen, wenn keine deutschen Texte übernommen werden sollen","Replace by an invalid language key if German descriptions are not wanted","Sprache 1:","DEU","durch ungültigen Sprachschlüssel ersetzen, wenn keine deutschen Texte übernommen werden sollen","Replace by an invalid language key if German descriptions are not wanted","Sprache 1:","DEU","durch ungültigen Sprachschlüssel ersetzen, wenn keine deutschen Texte übernommen werden sollen","Replace by an invalid language key if German descriptions are not wanted","Sprache 1:","DEU","durch ungültigen Sprachschlüssel ersetzen, wenn keine deutschen Texte übernommen werden sollen","Replace by an invalid language key if German descriptions are not wanted","Sprache 1:","DEU","durch ungültigen Sprachschlüssel ersetzen, wenn keine deutschen Texte übernommen werden sollen","Replace by an invalid language key if German descriptions are not wanted","Sprache 1:","DEU","durch ungültigen Sprachschlüssel ersetzen, wenn keine deutschen Texte übernommen werden sollen","Replace by an invalid language key if German descriptions are not wanted","Sprache 1:","DEU","durch ungültigen Sprachschlüssel ersetzen, wenn keine deutschen Texte übernommen werden sollen","Replace by an invalid language key if German descriptions are not wanted","Sprache 1:","DEU","durch ungültigen Sprachschlüssel ersetzen, wenn keine deutschen Texte übernommen werden sollen","Replace by an invalid language key if German descriptions are not wanted","Sprache 1:","DEU","durch ungültigen Sprachschlüssel ersetzen, wenn keine deutschen Texte übernommen werden sollen","Replace by an invalid language key if German descriptions are not wanted","Sprache 1:","DEU","durch ungültigen Sprachschlüssel ersetzen, wenn keine deutschen Texte übernommen werden sollen","Replace by an invalid language key if German descriptions are not wanted","Sprache 1:","DEU","durch ungültigen Sprachschlüssel ersetzen, wenn keine deutschen Texte übernommen werden sollen","Replace by an invalid language key if German descriptions are not wanted","Sprache 1:","DEU","durch ungültigen Sprachschlüssel ersetzen, wenn keine deutschen Texte übernommen werden sollen","Replace by an invalid language key if German descriptions are not wanted","Sprache 1:","DEU","durch ungültigen Sprachschlüssel ersetzen, wenn keine deutschen Texte übernommen werden sollen","Replace by an invalid language key if German descriptions are not wanted","Sprache 1:","DEU","durch ungültigen Sprachschlüssel ersetzen, wenn keine deutschen Texte übernommen werden sollen","Replace by an invalid language key if German descriptions are not wanted","Sprache 1:","DEU","durch ungültigen Sprachschlüssel ersetzen, wenn keine deutschen Texte übernommen werden sollen","Replace by an invalid language key if German descriptions are not wanted","Sprache 1:","DEU","durch ungültigen Sprachschlüssel ersetzen, wenn keine deutschen Texte übernommen werden sollen","Replace by an invalid language key if German descriptions are not wanted","Sprache 1:","DEU","durch ungültigen Sprachschlüssel ersetzen, wenn keine deutschen Texte übernommen werden sollen","Replace by an invalid language key if German descriptions are not wanted","Sprache 1:","DEU","durch ungültigen Sprachschlüssel ersetzen, wenn keine deutschen Texte übernommen werden sollen","Replace by an invalid language key if German descriptions are not wanted","Sprache 1:","DEU","durch ungültigen Sprachschlüssel ersetzen, wenn keine deutschen Texte übernommen werden sollen","Replace by an invalid language key if German descriptions are not wanted","Sprache 1:","DEU","durch ungültigen Sprachschlüssel ersetzen, wenn keine deutschen Texte übernommen werden sollen","Replace by an invalid language key if German descriptions are not wanted","Sprache 1:","DEU","durch ungültigen Sprachschlüssel ersetzen, wenn keine deutschen Texte übernommen werden sollen","Replace by an invalid language key if German descriptions are not wanted","Sprache 1:","DEU","durch ungültigen Sprachschlüssel ersetzen, wenn keine deutschen Texte übernommen werden sollen","Replace by an invalid language key if German descriptions are not wanted","Sprache 1:","DEU","durch ungültigen Sprachschlüssel ersetzen, wenn keine deutschen Texte übernommen werden sollen","Replace by an invalid language key if German descriptions are not wanted","Sprache 1:","DEU","durch ungültigen Sprachschlüssel ersetzen, wenn keine deutschen Texte übernommen werden sollen","Replace by an invalid language key if German descriptions are not wanted","Sprache 1:","DEU","durch ungültigen Sprachschlüssel ersetzen, wenn keine deutschen Texte übernommen werden sollen","Replace by an invalid language key if German descriptions are not wanted","Sprache 1:","DEU","durch ungültigen Sprachschlüssel ersetzen, wenn keine deutschen Texte übernommen werden sollen","Replace by an invalid language key if German descriptions are not wanted","Sprache 1:","DEU","durch ungültigen Sprachschlüssel ersetzen, wenn keine deutschen Texte übernommen werden sollen","Replace by an invalid language key if German descriptions are not wanted","Sprache 1:","DEU","durch ungültigen Sprachschlüssel ersetzen, wenn keine deutschen Texte übernommen werden sollen","Replace by an invalid language key if German descriptions are not wanted","Sprache 1:","DEU","durch ungültigen Sprachschlüssel ersetzen, wenn keine deutschen Texte übernommen werden sollen","Replace by an invalid language key if German descriptions are not wanted","Sprache 1:","DEU","durch ungültigen Sprachschlüssel ersetzen, wenn keine deutschen Texte übernommen werden sollen","Replace by an invalid language key if German descriptions are not wanted","Sprache 1:","DEU","durch ungültigen Sprachschlüssel ersetzen, wenn keine deutschen Texte übernommen werden sollen","Replace by an invalid language key if German descriptions are not wanted","Sprache 1:","DEU","durch ungültigen Sprachschlüssel ersetzen, wenn keine deutschen Texte übernommen werden sollen","Replace by an invalid language key if German descriptions are not wanted","Sprache 1:","DEU","durch ungültigen Sprachschlüssel ersetzen, wenn keine deutschen Texte übernommen werden sollen","Replace by an invalid language key if German descriptions are not wanted","Sprache 1:","DEU","durch ungültigen Sprachschlüssel ersetzen, wenn keine deutschen Texte übernommen werden sollen","Replace by an invalid language key if German descriptions are not wanted","Sprache 1:","DEU","durch ungültigen Sprachschlüssel ersetzen, wenn keine deutschen Texte übernommen werden sollen","Replace by an invalid language key if German descriptions are not wanted","Sprache 1:","DEU","durch ungültigen Sprachschlüssel ersetzen, wenn keine deutschen Texte übernommen werden sollen","Replace by an invalid language key if German descriptions are not wanted","Sprache 1:","DEU","durch ungültigen Sprachschlüssel ersetzen, wenn keine deutschen Texte übernommen werden sollen","Replace by an invalid language key if German descriptions are not wanted","Sprache 1:","DEU","durch ungültigen Sprachschlüssel ersetzen, wenn keine deutschen Texte übernommen werden sollen","Replace by an invalid language key if German descriptions are not wanted","Sprache 1:","DEU","durch ungültigen Sprachschlüssel ersetzen, wenn keine deutschen Texte übernommen werden sollen","Replace by an invalid language key if German descriptions are not wanted","Sprache 1:","DEU","durch ungültigen Sprachschlüssel ersetzen, wenn keine deutschen Texte übernommen werden sollen","Replace by an invalid language key if German descriptions are not wanted","Sprache 1:","DEU","durch ungültigen Sprachschlüssel ersetzen, wenn keine deutschen Texte übernommen werden sollen","Replace by an invalid language key if German descriptions are not wanted","Sprache 1:","DEU","durch ungültigen Sprachschlüssel ersetzen, wenn keine deutschen Texte übernommen werden sollen","Replace by an invalid language key if German descriptions are not wanted","Sprache 1:","DEU","durch ungültigen Sprachschlüssel ersetzen, wenn keine deutschen Texte übernommen werden sollen","Replace by an invalid language key if German descriptions are not wanted","Sprache 1:","DEU","durch ungültigen Sprachschlüssel ersetzen, wenn keine deutschen Texte übernommen werden sollen","Replace by an invalid language key if German descriptions are not wanted","Sprache 1:","DEU","durch ungültigen Sprachschlüssel ersetzen, wenn keine deutschen Texte übernommen werden sollen","Replace by an invalid language key if German descriptions are not wanted","Sprache 1:","DEU","durch ungültigen Sprachschlüssel ersetzen, wenn keine deutschen Texte übernommen werden sollen","Replace by an invalid language key if German descriptions are not wanted","Sprache 1:","DEU","durch ungültigen Sprachschlüssel ersetzen, wenn keine deutschen Texte übernommen werden sollen","Replace by an invalid language key if German descriptions are not wanted","Sprache 1:","DEU","durch ungültigen Sprachschlüssel ersetzen, wenn keine deutschen Texte übernommen werden sollen","Replace by an invalid language key if German descriptions are not wanted","Sprache 1:","DEU","durch ungültigen Sprachschlüssel ersetzen, wenn keine deutschen Texte übernommen werden sollen","Replace by an invalid language key if German descriptions are not wanted","Sprache 1:","DEU","durch ungültigen Sprachschlüssel ersetzen, wenn keine deutschen Texte übernommen werden sollen","Replace by an invalid language key if German descriptions are not wanted","Sprache 1:","DEU","durch ungültigen Sprachschlüssel ersetzen, wenn keine deutschen Texte übernommen werden sollen","Replace by an invalid language key if German descriptions are not wanted","Sprache 1:","DEU","durch ungültigen Sprachschlüssel ersetzen, wenn keine deutschen Texte übernommen werden sollen","Replace by an invalid language key if German descriptions are not wanted","Sprache 1:","DEU","durch ungültigen Sprachschlüssel ersetzen, wenn keine deutschen Texte übernommen werden sollen","Replace by an invalid language key if German descriptions are not wanted","Sprache 1:","DEU","durch ungültigen Sprachschlüssel ersetzen, wenn keine deutschen Texte übernommen werden sollen","Replace by an invalid language key if German descriptions are not wanted","Sprache 1:","DEU","durch ungültigen Sprachschlüssel ersetzen, wenn keine deutschen Texte übernommen werden sollen","Replace by an invalid language key if German descriptions are not wanted","Sprache 1:","DEU","durch ungültigen Sprachschlüssel ersetzen, wenn keine deutschen Texte übernommen werden sollen","Replace by an invalid language key if German descriptions are not wanted","Sprache 1:","DEU","durch ungültigen Sprachschlüssel ersetzen, wenn keine deutschen Texte übernommen werden sollen","Replace by an invalid language key if German descriptions are not wanted","Sprache 1:","DEU","durch ungültigen Sprachschlüssel ersetzen, wenn keine deutschen Texte übernommen werden sollen","Replace by an invalid language key if German descriptions are not wanted","Sprache 1:","DEU","durch ungültigen Sprachschlüssel ersetzen, wenn keine deutschen Texte übernommen werden sollen","Replace by an invalid language key if German descriptions are not wanted","Sprache 1:","DEU","durch ungültigen Sprachschlüssel ersetzen, wenn keine deutschen Texte übernommen werden sollen","Replace by an invalid language key if German descriptions are not wanted","Sprache 1:","DEU","durch ungültigen Sprachschlüssel ersetzen, wenn keine deutschen Texte übernommen werden sollen","Replace by an invalid language key if German descriptions are not wanted","Sprache 1:","DEU","durch ungültigen Sprachschlüssel ersetzen, wenn keine deutschen Texte übernommen werden sollen","Replace by an invalid language key if German descriptions are not wanted","Sprache 1:","DEU","durch ungültigen Sprachschlüssel ersetzen, wenn keine deutschen Texte übernommen werden sollen","Replace by an invalid language key if German descriptions are not wanted","Sprache 1:","DEU","durch ungültigen Sprachschlüssel ersetzen, wenn keine deutschen Texte übernommen werden sollen","Replace by an invalid language key if German descriptions are not wanted","Sprache 1:","DEU","durch ungültigen Sprachschlüssel ersetzen, wenn keine deutschen Texte übernommen werden sollen","Replace by an invalid language key if German descriptions are not wanted","Sprache 1:","DEU","durch ungültigen Sprachschlüssel ersetzen, wenn keine deutschen Texte übernommen werden sollen","Replace by an invalid language key if German descriptions are not wanted","Sprache 1:","DEU","durch ungültigen Sprachschlüssel ersetzen, wenn keine deutschen Texte übernommen werden sollen","Replace by an invalid language key if German descriptions are not wanted","Sprache 1:","DEU","durch ungültigen Sprachschlüssel ersetzen, wenn keine deutschen Texte übernommen werden sollen","Replace by an invalid language key if German descriptions are not wanted","Sprache 1:","DEU","durch ungültigen Sprachschlüssel ersetzen, wenn keine deutschen Texte übernommen werden sollen","Replace by an invalid language key if German descriptions are not wanted","Sprache 1:","DEU","durch ungültigen Sprachschlüssel ersetzen, wenn keine deutschen Texte übernommen werden sollen","Replace by an invalid language key if German descriptions are not wanted","Sprache 1:","DEU","durch ungültigen Sprachschlüssel ersetzen, wenn keine deutschen Texte übernommen werden sollen","Replace by an invalid language key if German descriptions are not wanted","Sprache 1:","DEU","durch ungültigen Sprachschlüssel ersetzen, wenn keine deutschen Texte übernommen werden sollen","Replace by an invalid language key if German descriptions are not wanted","Sprache 1:","DEU","durch ungültigen Sprachschlüssel ersetzen, wenn keine deutschen Texte übernommen werden sollen","Replace by an invalid language key if German descriptions are not wanted","Sprache 1:","DEU","durch ungültigen Sprachschlüssel ersetzen, wenn keine deutschen Texte übernommen werden sollen","Replace by an invalid language key if German descriptions are not wanted","Sprache 1:","DEU","durch ungültigen Sprachschlüssel ersetzen, wenn keine deutschen Texte übernommen werden sollen","Replace by an invalid language key if German descriptions are not wanted","Sprache 1:","DEU","durch ungültigen Sprachschlüssel ersetzen, wenn keine deutschen Texte übernommen werden sollen","Replace by an invalid language key if German descriptions are not wanted","Sprache 1:","DEU","durch ungültigen Sprachschlüssel ersetzen, wenn keine deutschen Texte übernommen werden sollen","Replace by an invalid language key if German descriptions are not wanted","Sprache 1:","DEU","durch ungültigen Sprachschlüssel ersetzen, wenn keine deutschen Texte übernommen werden sollen","Replace by an invalid language key if German descriptions are not wanted","Sprache 1:","DEU","durch ungültigen Sprachschlüssel ersetzen, wenn keine deutschen Texte übernommen werden sollen","Replace by an invalid language key if German descriptions are not wanted","Sprache 1:","DEU","durch ungültigen Sprachschlüssel ersetzen, wenn keine deutschen Texte übernommen werden sollen","Replace by an invalid language key if German descriptions are not wanted","Sprache 1:","DEU","durch ungültigen Sprachschlüssel ersetzen, wenn keine deutschen Texte übernommen werden sollen","Replace by an invalid language key if German descriptions are not wanted","Sprache 1:","DEU","durch ungültigen Sprachschlüssel ersetzen, wenn keine deutschen Texte übernommen werden sollen","Replace by an invalid language key if German descriptions are not wanted","Sprache 1:","DEU","durch ungültigen Sprachschlüssel ersetzen, wenn keine deutschen Texte übernommen werden sollen","Replace by an invalid language key if German descriptions are not wanted","Sprache 1:","DEU","durch ungültigen Sprachschlüssel ersetzen, wenn keine deutschen Texte übernommen werden sollen","Replace by an invalid language key if German descriptions are not wanted","Sprache 1:","DEU","durch ungültigen Sprachschlüssel ersetzen, wenn keine deutschen Texte übernommen werden sollen","Replace by an invalid language key if German descriptions are not wanted","Sprache 1:","DEU","durch ungültigen Sprachschlüssel ersetzen, wenn keine deutschen Texte übernommen werden sollen","Replace by an invalid language key if German descriptions are not wanted","Sprache 1:","DEU","durch ungültigen Sprachschlüssel ersetzen, wenn keine deutschen Texte übernommen werden sollen","Replace by an invalid language key if German descriptions are not wanted","Sprache 1:","DEU","durch ungültigen Sprachschlüssel ersetzen, wenn keine deutschen Texte übernommen werden sollen","Replace by an invalid language key if German descriptions are not wanted","Sprache 1:","DEU","durch ungültigen Sprachschlüssel ersetzen, wenn keine deutschen Texte übernommen werden sollen","Replace by an invalid language key if German descriptions are not wanted","Sprache 1:","DEU","durch ungültigen Sprachschlüssel ersetzen, wenn keine deutschen Texte übernommen werden sollen","Replace by an invalid language key if German descriptions are not wanted","Sprache 1:","DEU","durch ungültigen Sprachschlüssel ersetzen, wenn keine deutschen Texte übernommen werden sollen","Replace by an invalid language key if German descriptions are not wanted","Sprache 1:","DEU","durch ungültigen Sprachschlüssel ersetzen, wenn keine deutschen Texte übernommen werden sollen","Replace by an invalid language key if German descriptions are not wanted","Sprache 1:","DEU","durch ungültigen Sprachschlüssel ersetzen, wenn keine deutschen Texte übernommen werden sollen","Replace by an invalid language key if German descriptions are not wanted","Sprache 1:","DEU","durch ungültigen Sprachschlüssel ersetzen, wenn keine deutschen Texte übernommen werden sollen","Replace by an invalid language key if German descriptions are not wanted","Sprache 1:","DEU","durch ungültigen Sprachschlüssel ersetzen, wenn keine deutschen Texte übernommen werden sollen","Replace by an invalid language key if German descriptions are not wanted","Sprache 1:","DEU","durch ungültigen Sprachschlüssel ersetzen, wenn keine deutschen Texte übernommen werden sollen","Replace by an invalid language key if German descriptions are not wanted","Sprache 1:","DEU","durch ungültigen Sprachschlüssel ersetzen, wenn keine deutschen Texte übernommen werden sollen","Replace by an invalid language key if German descriptions are not wanted","Sprache 1:","DEU","durch ungültigen Sprachschlüssel ersetzen, wenn keine deutschen Texte übernommen werden sollen","Replace by an invalid language key if German descriptions are not wanted","Sprache 1:","DEU","durch ungültigen Sprachschlüssel ersetzen, wenn keine deutschen Texte übernommen werden sollen","Replace by an invalid language key if German descriptions are not wanted","Sprache 1:","DEU","durch ungültigen Sprachschlüssel ersetzen, wenn keine deutschen Texte übernommen werden sollen","Replace by an invalid language key if German descriptions are not wanted","Sprache 1:","DEU","durch ungültigen Sprachschlüssel ersetzen, wenn keine deutschen Texte übernommen werden sollen","Replace by an invalid language key if German descriptions are not wanted","Sprache 1:","DEU","durch ungültigen Sprachschlüssel ersetzen, wenn keine deutschen Texte übernommen werden sollen","Replace by an invalid language key if German descriptions are not wanted","Sprache 1:","DEU","durch ungültigen Sprachschlüssel ersetzen, wenn keine deutschen Texte übernommen werden sollen","Replace by an invalid language key if German descriptions are not wanted","Sprache 1:","DEU","durch ungültigen Sprachschlüssel ersetzen, wenn keine deutschen Texte übernommen werden sollen","Replace by an invalid language key if German descriptions are not wanted","Sprache 1:","DEU","durch ungültigen Sprachschlüssel ersetzen, wenn keine deutschen Texte übernommen werden sollen","Replace by an invalid language key if German descriptions are not wanted","Sprache 1:","DEU","durch ungültigen Sprachschlüssel ersetzen, wenn keine deutschen Texte übernommen werden sollen","Replace by an invalid language key if German descriptions are not wanted","Sprache 1:","DEU","durch ungültigen Sprachschlüssel ersetzen, wenn keine deutschen Texte übernommen werden sollen","Replace by an invalid language key if German descriptions are not wanted","Sprache 1:","DEU","durch ungültigen Sprachschlüssel ersetzen, wenn keine deutschen Texte übernommen werden sollen","Replace by an invalid language key if German descriptions are not wanted","Sprache 1:","DEU","durch ungültigen Sprachschlüssel ersetzen, wenn keine deutschen Texte übernommen werden sollen","Replace by an invalid language key if German descriptions are not wanted","Sprache 1:","DEU","durch ungültigen Sprachschlüssel ersetzen, wenn keine deutschen Texte übernommen werden sollen","Replace by an invalid language key if German descriptions are not wanted","Sprache 1:","DEU","durch ungültigen Sprachschlüssel ersetzen, wenn keine deutschen Texte übernommen werden sollen","Replace by an invalid language key if German descriptions are not wanted","Sprache 1:","DEU","durch ungültigen Sprachschlüssel ersetzen, wenn keine deutschen Texte übernommen werden sollen","Replace by an invalid language key if German descriptions are not wanted","Sprache 1:","DEU","durch ungültigen Sprachschlüssel ersetzen, wenn keine deutschen Texte übernommen werden sollen","Replace by an invalid language key if German descriptions are not wanted","Sprache 1:","DEU","durch ungültigen Sprachschlüssel ersetzen, wenn keine deutschen Texte übernommen werden sollen","Replace by an invalid language key if German descriptions are not wanted","Sprache 1:","DEU","durch ungültigen Sprachschlüssel ersetzen, wenn keine deutschen Texte übernommen werden sollen","Replace by an invalid language key if German descriptions are not wanted","Sprache 1:","DEU","durch ungültigen Sprachschlüssel ersetzen, wenn keine deutschen Texte übernommen werden sollen","Replace by an invalid language key if German descriptions are not wanted","Sprache 1:","DEU","durch ungültigen Sprachschlüssel ersetzen, wenn keine deutschen Texte übernommen werden sollen","Replace by an invalid language key if German descriptions are not wanted","Sprache 1:","DEU","durch ungültigen Sprachschlüssel ersetzen, wenn keine deutschen Texte übernommen werden sollen","Replace by an invalid language key if German descriptions are not wanted","Sprache 1:","DEU","durch ungültigen Sprachschlüssel ersetzen, wenn keine deutschen Texte übernommen werden sollen","Replace by an invalid language key if German descriptions are not wanted","Sprache 1:","DEU","durch ungültigen Sprachschlüssel ersetzen, wenn keine deutschen Texte übernommen werden sollen","Replace by an invalid language key if German descriptions are not wanted","Sprache 1:","DEU","durch ungültigen Sprachschlüssel ersetzen, wenn keine deutschen Texte übernommen werden sollen","Replace by an invalid language key if German descriptions are not wanted","Sprache 1:","DEU","durch ungültigen Sprachschlüssel ersetzen, wenn keine deutschen Texte übernommen werden sollen","Replace by an invalid language key if German descriptions are not wanted","Sprache 1:","DEU","durch ungültigen Sprachschlüssel ersetzen, wenn keine deutschen Texte übernommen werden sollen","Replace by an invalid language key if German descriptions are not wanted","Sprache 1:","DEU","durch ungültigen Sprachschlüssel ersetzen, wenn keine deutschen Texte übernommen werden sollen","Replace by an invalid language key if German descriptions are not wanted","Sprache 1:","DEU","durch ungültigen Sprachschlüssel ersetzen, wenn keine deutschen Texte übernommen werden sollen","Replace by an invalid language key if German descriptions are not wanted","Sprache 1:","DEU","durch ungültigen Sprachschlüssel ersetzen, wenn keine deutschen Texte übernommen werden sollen","Replace by an invalid language key if German descriptions are not wanted","Sprache 1:","DEU","durch ungültigen Sprachschlüssel ersetzen, wenn keine deutschen Texte übernommen werden sollen","Replace by an invalid language key if German descriptions are not wanted","Sprache 1:","DEU","durch ungültigen Sprachschlüssel ersetzen, wenn keine deutschen Texte übernommen werden sollen","Replace by an invalid language key if German descriptions are not wanted","Sprache 1:","DEU","durch ungültigen Sprachschlüssel ersetzen, wenn keine deutschen Texte übernommen werden sollen","Replace by an invalid language key if German descriptions are not wanted","Sprache 1:","DEU","durch ungültigen Sprachschlüssel ersetzen, wenn keine deutschen Texte übernommen werden sollen","Replace by an invalid language key if German descriptions are not wanted","Sprache 1:","DEU","durch ungültigen Sprachschlüssel ersetzen, wenn keine deutschen Texte übernommen werden sollen","Replace by an invalid language key if German descriptions are not wanted","Sprache 1:","DEU","durch ungültigen Sprachschlüssel ersetzen, wenn keine deutschen Texte übernommen werden sollen","Replace by an invalid language key if German descriptions are not wanted","Sprache 1:","DEU","durch ungültigen Sprachschlüssel ersetzen, wenn keine deutschen Texte übernommen werden sollen","Replace by an invalid language key if German descriptions are not wanted","Sprache 1:","DEU","durch ungültigen Sprachschlüssel ersetzen, wenn keine deutschen Texte übernommen werden sollen","Replace by an invalid language key if German descriptions are not wanted","Sprache 1:","DEU","durch ungültigen Sprachschlüssel ersetzen, wenn keine deutschen Texte übernommen werden sollen","Replace by an invalid language key if German descriptions are not wanted","Sprache 1:","DEU","durch ungültigen Sprachschlüssel ersetzen, wenn keine deutschen Texte übernommen werden sollen","Replace by an invalid language key if German descriptions are not wanted","Sprache 1:","DEU","durch ungültigen Sprachschlüssel ersetzen, wenn keine deutschen Texte übernommen werden sollen","Replace by an invalid language key if German descriptions are not wanted","Sprache 1:","DEU","durch ungültigen Sprachschlüssel ersetzen, wenn keine deutschen Texte übernommen werden sollen","Replace by an invalid language key if German descriptions are not wanted","Sprache 1:","DEU","durch ungültigen Sprachschlüssel ersetzen, wenn keine deutschen Texte übernommen werden sollen","Replace by an invalid language key if German descriptions are not wanted","Sprache 1:","DEU","durch ungültigen Sprachschlüssel ersetzen, wenn keine deutschen Texte übernommen werden sollen","Replace by an invalid language key if German descriptions are not wanted","Sprache 1:","DEU","durch ungültigen Sprachschlüssel ersetzen, wenn keine deutschen Texte übernommen werden sollen","Replace by an invalid language key if German descriptions are not wanted","Sprache 1:","DEU","durch ungültigen Sprachschlüssel ersetzen, wenn keine deutschen Texte übernommen werden sollen","Replace by an invalid language key if German descriptions are not wanted","Sprache 1:","DEU","durch ungültigen Sprachschlüssel ersetzen, wenn keine deutschen Texte übernommen werden sollen","Replace by an invalid language key if German descriptions are not wanted","Sprache 1:","DEU","durch ungültigen Sprachschlüssel ersetzen, wenn keine deutschen Texte übernommen werden sollen","Replace by an invalid language key if German descriptions are not wanted","Sprache 1:","DEU","durch ungültigen Sprachschlüssel ersetzen, wenn keine deutschen Texte übernommen werden sollen","Replace by an invalid language key if German descriptions are not wanted","Sprache 1:","DEU","durch ungültigen Sprachschlüssel ersetzen, wenn keine deutschen Texte übernommen werden sollen","Replace by an invalid language key if German descriptions are not wanted","Sprache 1:","DEU","durch ungültigen Sprachschlüssel ersetzen, wenn keine deutschen Texte übernommen werden sollen","Replace by an invalid language key if German descriptions are not wanted","Sprache 1:","DEU","durch ungültigen Sprachschlüssel ersetzen, wenn keine deutschen Texte übernommen werden sollen","Replace by an invalid language key if German descriptions are not wanted","Sprache 1:","DEU","durch ungültigen Sprachschlüssel ersetzen, wenn keine deutschen Texte übernommen werden sollen","Replace by an invalid language key if German descriptions are not wanted","Sprache 1:","DEU","durch ungültigen Sprachschlüssel ersetzen, wenn keine deutschen Texte übernommen werden sollen","Replace by an invalid language key if German descriptions are not wanted","Sprache 1:","DEU","durch ungültigen Sprachschlüssel ersetzen, wenn keine deutschen Texte übernommen werden sollen","Replace by an invalid language key if German descriptions are not wanted","Sprache 1:","DEU","durch ungültigen Sprachschlüssel ersetzen, wenn keine deutschen Texte übernommen werden sollen","Replace by an invalid language key if German descriptions are not wanted","Sprache 1:","DEU","durch ungültigen Sprachschlüssel ersetzen, wenn keine deutschen Texte übernommen werden sollen","Replace by an invalid language key if German descriptions are not wanted","Sprache 1:","DEU","durch ungültigen Sprachschlüssel ersetzen, wenn keine deutschen Texte übernommen werden sollen","Replace by an invalid language key if German descriptions are not wanted","Sprache 1:","DEU","durch ungültigen Sprachschlüssel ersetzen, wenn keine deutschen Texte übernommen werden sollen","Replace by an invalid language key if German descriptions are not wanted","Sprache 1:","DEU","durch ungültigen Sprachschlüssel ersetzen, wenn keine deutschen Texte übernommen werden sollen","Replace by an invalid language key if German descriptions are not wanted","Sprache 1:","DEU","durch ungültigen Sprachschlüssel ersetzen, wenn keine deutschen Texte übernommen werden sollen","Replace by an invalid language key if German descriptions are not wanted","Sprache 1:","DEU","durch ungültigen Sprachschlüssel ersetzen, wenn keine deutschen Texte übernommen werden sollen","Replace by an invalid language key if German descriptions are not wanted","Sprache 1:","DEU","durch ungültigen Sprachschlüssel ersetzen, wenn keine deutschen Texte übernommen werden sollen","Replace by an invalid language key if German descriptions are not wanted","Sprache 1:","DEU","durch ungültigen Sprachschlüssel ersetzen, wenn keine deutschen Texte übernommen werden sollen","Replace by an invalid language key if German descriptions are not wanted","Sprache 1:","DEU","durch ungültigen Sprachschlüssel ersetzen, wenn keine deutschen Texte übernommen werden sollen","Replace by an invalid language key if German descriptions are not wanted","Sprache 1:","DEU","durch ungültigen Sprachschlüssel ersetzen, wenn keine deutschen Texte übernommen werden sollen","Replace by an invalid language key if German descriptions are not wanted","Sprache 1:","DEU","durch ungültigen Sprachschlüssel ersetzen, wenn keine deutschen Texte übernommen werden sollen","Replace by an invalid language key if German descriptions are not wanted","Sprache 1:","DEU","durch ungültigen Sprachschlüssel ersetzen, wenn keine deutschen Texte übernommen werden sollen","Replace by an invalid language key if German descriptions are not wanted","Sprache 1:","DEU","durch ungültigen Sprachschlüssel ersetzen, wenn keine deutschen Texte übernommen werden sollen","Replace by an invalid language key if German descriptions are not wanted","Sprache 1:","DEU","durch ungültigen Sprachschlüssel ersetzen, wenn keine deutschen Texte übernommen werden sollen","Replace by an invalid language key if German descriptions are not wanted","Sprache 1:","DEU","durch ungültigen Sprachschlüssel ersetzen, wenn keine deutschen Texte übernommen werden sollen","Replace by an invalid language key if German descriptions are not wanted","Sprache 1:","DEU","durch ungültigen Sprachschlüssel ersetzen, wenn keine deutschen Texte übernommen werden sollen","Replace by an invalid language key if German descriptions are not wanted","Sprache 1:","DEU","durch ungültigen Sprachschlüssel ersetzen, wenn keine deutschen Texte übernommen werden sollen","Replace by an invalid language key if German descriptions are not wanted","Sprache 1:","DEU","durch ungültigen Sprachschlüssel ersetzen, wenn keine deutschen Texte übernommen werden sollen","Replace by an invalid language key if German descriptions are not wanted","Sprache 1:","DEU","durch ungültigen Sprachschlüssel ersetzen, wenn keine deutschen Texte übernommen werden sollen","Replace by an invalid language key if German descriptions are not wanted","Sprache 1:","DEU","durch ungültigen Sprachschlüssel ersetzen, wenn keine deutschen Texte übernommen werden sollen","Replace by an invalid language key if German descriptions are not wanted","Sprache 1:","DEU","durch ungültigen Sprachschlüssel ersetzen, wenn keine deutschen Texte übernommen werden sollen","Replace by an invalid language key if German descriptions are not wanted","Sprache 1:","DEU","durch ungültigen Sprachschlüssel ersetzen, wenn keine deutschen Texte übernommen werden sollen","Replace by an invalid language key if German descriptions are not wanted","Sprache 1:","DEU","durch ungültigen Sprachschlüssel ersetzen, wenn keine deutschen Texte übernommen werden sollen","Replace by an invalid language key if German descriptions are not wanted","Sprache 1:","DEU","durch ungültigen Sprachschlüssel ersetzen, wenn keine deutschen Texte übernommen werden sollen","Replace by an invalid language key if German descriptions are not wanted","Sprache 1:","DEU","durch ungültigen Sprachschlüssel ersetzen, wenn keine deutschen Texte übernommen werden sollen","Replace by an invalid language key if German descriptions are not wanted","Sprache 1:","DEU","durch ungültigen Sprachschlüssel ersetzen, wenn keine deutschen Texte übernommen werden sollen","Replace by an invalid language key if German descriptions are not wanted","Sprache 1:","DEU","durch ungültigen Sprachschlüssel ersetzen, wenn keine deutschen Texte übernommen werden sollen","Replace by an invalid language key if German descriptions are not wanted","Sprache 1:","DEU","durch ungültigen Sprachschlüssel ersetzen, wenn keine deutschen Texte übernommen werden sollen","Replace by an invalid language key if German descriptions are not wanted","Sprache 1:","DEU","durch ungültigen Sprachschlüssel ersetzen, wenn keine deutschen Texte übernommen werden sollen","Replace by an invalid language key if German descriptions are not wanted","Sprache 1:","DEU","durch ungültigen Sprachschlüssel ersetzen, wenn keine deutschen Texte übernommen werden sollen","Replace by an invalid language key if German descriptions are not wanted","Sprache 1:","DEU","durch ungültigen Sprachschlüssel ersetzen, wenn keine deutschen Texte übernommen werden sollen","Replace by an invalid language key if German descriptions are not wanted","Sprache 1:","DEU","durch ungültigen Sprachschlüssel ersetzen, wenn keine deutschen Texte übernommen werden sollen","Replace by an invalid language key if German descriptions are not wanted","Sprache 1:","DEU","durch ungültigen Sprachschlüssel ersetzen, wenn keine deutschen Texte übernommen werden sollen","Replace by an invalid language key if German descriptions are not wanted","Sprache 1:","DEU","durch ungültigen Sprachschlüssel ersetzen, wenn keine deutschen Texte übernommen werden sollen","Replace by an invalid language key if German descriptions are not wanted","Sprache 1:","DEU","durch ungültigen Sprachschlüssel ersetzen, wenn keine deutschen Texte übernommen werden sollen","Replace by an invalid language key if German descriptions are not wanted","Sprache 1:","DEU","durch ungültigen Sprachschlüssel ersetzen, wenn keine deutschen Texte übernommen werden sollen","Replace by an invalid language key if German descriptions are not wanted","Sprache 1:","DEU","durch ungültigen Sprachschlüssel ersetzen, wenn keine deutschen Texte übernommen werden sollen","Replace by an invalid language key if German descriptions are not wanted","Sprache 1:","DEU","durch ungültigen Sprachschlüssel ersetzen, wenn keine deutschen Texte übernommen werden sollen","Replace by an invalid language key if German descriptions are not wanted","Sprache 1:","DEU","durch ungültigen Sprachschlüssel ersetzen, wenn keine deutschen Texte übernommen werden sollen","Replace by an invalid language key if German descriptions are not wanted","Sprache 1:","DEU","durch ungültigen Sprachschlüssel ersetzen, wenn keine deutschen Texte übernommen werden sollen","Replace by an invalid language key if German descriptions are not wanted","Sprache 1:","DEU","durch ungültigen Sprachschlüssel ersetzen, wenn keine deutschen Texte übernommen werden sollen","Replace by an invalid language key if German descriptions are not wanted","Sprache 1:","DEU","durch ungültigen Sprachschlüssel ersetzen, wenn keine deutschen Texte übernommen werden sollen","Replace by an invalid language key if German descriptions are not wanted","Sprache 1:","DEU","durch ungültigen Sprachschlüssel ersetzen, wenn keine deutschen Texte übernommen werden sollen","Replace by an invalid language key if German descriptions are not wanted","Sprache 1:","DEU","durch ungültigen Sprachschlüssel ersetzen, wenn keine deutschen Texte übernommen werden sollen","Replace by an invalid language key if German descriptions are not wanted","Sprache 1:","DEU","durch ungültigen Sprachschlüssel ersetzen, wenn keine deutschen Texte übernommen werden sollen","Replace by an invalid language key if German descriptions are not wanted","Sprache 1:","DEU","durch ungültigen Sprachschlüssel ersetzen, wenn keine deutschen Texte übernommen werden sollen","Replace by an invalid language key if German descriptions are not wanted","Sprache 1:","DEU","durch ungültigen Sprachschlüssel ersetzen, wenn keine deutschen Texte übernommen werden sollen","Replace by an invalid language key if German descriptions are not wanted","Sprache 1:","DEU","durch ungültigen Sprachschlüssel ersetzen, wenn keine deutschen Texte übernommen werden sollen","Replace by an invalid language key if German descriptions are not wanted","Sprache 1:","DEU","durch ungültigen Sprachschlüssel ersetzen, wenn keine deutschen Texte übernommen werden sollen","Replace by an invalid language key if German descriptions are not wanted","Sprache 1:","DEU","durch ungültigen Sprachschlüssel ersetzen, wenn keine deutschen Texte übernommen werden sollen","Replace by an invalid language key if German descriptions are not wanted","Sprache 1:","DEU","durch ungültigen Sprachschlüssel ersetzen, wenn keine deutschen Texte übernommen werden sollen","Replace by an invalid language key if German descriptions are not wanted","Sprache 1:","DEU","durch ungültigen Sprachschlüssel ersetzen, wenn keine deutschen Texte übernommen werden sollen","Replace by an invalid language key if German descriptions are not wanted","Sprache 1:","DEU","durch ungültigen Sprachschlüssel ersetzen, wenn keine deutschen Texte übernommen werden sollen","Replace by an invalid language key if German descriptions are not wanted","Sprache 1:","DEU","durch ungültigen Sprachschlüssel ersetzen, wenn keine deutschen Texte übernommen werden sollen","Replace by an invalid language key if German descriptions are not wanted","Sprache 1:","DEU","durch ungültigen Sprachschlüssel ersetzen, wenn keine deutschen Texte übernommen werden sollen","Replace by an invalid language key if German descriptions are not wanted","Sprache 1:","DEU","durch ungültigen Sprachschlüssel ersetzen, wenn keine deutschen Texte übernommen werden sollen","Replace by an invalid language key if German descriptions are not wanted","Sprache 1:","DEU","durch ungültigen Sprachschlüssel ersetzen, wenn keine deutschen Texte übernommen werden sollen","Replace by an invalid language key if German descriptions are not wanted","Sprache 1:","DEU","durch ungültigen Sprachschlüssel ersetzen, wenn keine deutschen Texte übernommen werden sollen","Replace by an invalid language key if German descriptions are not wanted","Sprache 1:","DEU","durch ungültigen Sprachschlüssel ersetzen, wenn keine deutschen Texte übernommen werden sollen","Replace by an invalid language key if German descriptions are not wanted","Sprache 1:","DEU","durch ungültigen Sprachschlüssel ersetzen, wenn keine deutschen Texte übernommen werden sollen","Replace by an invalid language key if German descriptions are not wanted","Sprache 1:","DEU","durch ungültigen Sprachschlüssel ersetzen, wenn keine deutschen Texte übernommen werden sollen","Replace by an invalid language key if German descriptions are not wanted","Sprache 1:","DEU","durch ungültigen Sprachschlüssel ersetzen, wenn keine deutschen Texte übernommen werden sollen","Replace by an invalid language key if German descriptions are not wanted","Sprache 1:","DEU","durch ungültigen Sprachschlüssel ersetzen, wenn keine deutschen Texte übernommen werden sollen","Replace by an invalid language key if German descriptions are not wanted","Sprache 1:","DEU","durch ungültigen Sprachschlüssel ersetzen, wenn keine deutschen Texte übernommen werden sollen","Replace by an invalid language key if German descriptions are not wanted","Sprache 1:","DEU","durch ungültigen Sprachschlüssel ersetzen, wenn keine deutschen Texte übernommen werden sollen","Replace by an invalid language key if German descriptions are not wanted","Sprache 1:","DEU","durch ungültigen Sprachschlüssel ersetzen, wenn keine deutschen Texte übernommen werden sollen","Replace by an invalid language key if German descriptions are not wanted","Sprache 1:","DEU","durch ungültigen Sprachschlüssel ersetzen, wenn keine deutschen Texte übernommen werden sollen","Replace by an invalid language key if German descriptions are not wanted","Sprache 1:","DEU","durch ungültigen Sprachschlüssel ersetzen, wenn keine deutschen Texte übernommen werden sollen","Replace by an invalid language key if German descriptions are not wanted","Sprache 1:","DEU","durch ungültigen Sprachschlüssel ersetzen, wenn keine deutschen Texte übernommen werden sollen","Replace by an invalid language key if German descriptions are not wanted","Sprache 1:","DEU","durch ungültigen Sprachschlüssel ersetzen, wenn keine deutschen Texte übernommen werden sollen","Replace by an invalid language key if German descriptions are not wanted","Sprache 1:","DEU","durch ungültigen Sprachschlüssel ersetzen, wenn keine deutschen Texte übernommen werden sollen","Replace by an invalid language key if German descriptions are not wanted","Sprache 1:","DEU","durch ungültigen Sprachschlüssel ersetzen, wenn keine deutschen Texte übernommen werden sollen","Replace by an invalid language key if German descriptions are not wanted","Sprache 1:","DEU","durch ungültigen Sprachschlüssel ersetzen, wenn keine deutschen Texte übernommen werden sollen","Replace by an invalid language key if German descriptions are not wanted","Sprache 1:","DEU","durch ungültigen Sprachschlüssel ersetzen, wenn keine deutschen Texte übernommen werden sollen","Replace by an invalid language key if German descriptions are not wanted","Sprache 1:","DEU","durch ungültigen Sprachschlüssel ersetzen, wenn keine deutschen Texte übernommen werden sollen","Replace by an invalid language key if German descriptions are not wanted","Sprache 1:","DEU","durch ungültigen Sprachschlüssel ersetzen, wenn keine deutschen Texte übernommen werden sollen","Replace by an invalid language key if German descriptions are not wanted","Sprache 1:","DEU","durch ungültigen Sprachschlüssel ersetzen, wenn keine deutschen Texte übernommen werden sollen","Replace by an invalid language key if German descriptions are not wanted","Sprache 1:","DEU","durch ungültigen Sprachschlüssel ersetzen, wenn keine deutschen Texte übernommen werden sollen","Replace by an invalid language key if German descriptions are not wanted","Sprache 1:","DEU","durch ungültigen Sprachschlüssel ersetzen, wenn keine deutschen Texte übernommen werden sollen","Replace by an invalid language key if German descriptions are not wanted","Sprache 1:","DEU","durch ungültigen Sprachschlüssel ersetzen, wenn keine deutschen Texte übernommen werden sollen","Replace by an invalid language key if German descriptions are not wanted","Sprache 1:","DEU","durch ungültigen Sprachschlüssel ersetzen, wenn keine deutschen Texte übernommen werden sollen","Replace by an invalid language key if German descriptions are not wanted","Sprache 1:","DEU","durch ungültigen Sprachschlüssel ersetzen, wenn keine deutschen Texte übernommen werden sollen","Replace by an invalid language key if German descriptions are not wanted","Sprache 1:","DEU","durch ungültigen Sprachschlüssel ersetzen, wenn keine deutschen Texte übernommen werden sollen","Replace by an invalid language key if German descriptions are not wanted","Sprache 1:","DEU","durch ungültigen Sprachschlüssel ersetzen, wenn keine deutschen Texte übernommen werden sollen","Replace by an invalid language key if German descriptions are not wanted","Sprache 1:","DEU","durch ungültigen Sprachschlüssel ersetzen, wenn keine deutschen Texte übernommen werden sollen","Replace by an invalid language key if German descriptions are not wanted","Sprache 1:","DEU","durch ungültigen Sprachschlüssel ersetzen, wenn keine deutschen Texte übernommen werden sollen","Replace by an invalid language key if German descriptions are not wanted","Sprache 1:","DEU","durch ungültigen Sprachschlüssel ersetzen, wenn keine deutschen Texte übernommen werden sollen","Replace by an invalid language key if German descriptions are not wanted","Sprache 1:","DEU","durch ungültigen Sprachschlüssel ersetzen, wenn keine deutschen Texte übernommen werden sollen","Replace by an invalid language key if German descriptions are not wanted","Sprache 1:","DEU","durch ungültigen Sprachschlüssel ersetzen, wenn keine deutschen Texte übernommen werden sollen","Replace by an invalid language key if German descriptions are not wanted","Sprache 1:","DEU","durch ungültigen Sprachschlüssel ersetzen, wenn keine deutschen Texte übernommen werden sollen","Replace by an invalid language key if German descriptions are not wanted","Sprache 1:","DEU","durch ungültigen Sprachschlüssel ersetzen, wenn keine deutschen Texte übernommen werden sollen","Replace by an invalid language key if German descriptions are not wanted","Sprache 1:","DEU","durch ungültigen Sprachschlüssel ersetzen, wenn keine deutschen Texte übernommen werden sollen","Replace by an invalid language key if German descriptions are not wanted","Sprache 1:","DEU","durch ungültigen Sprachschlüssel ersetzen, wenn keine deutschen Texte übernommen werden sollen","Replace by an invalid language key if German descriptions are not wanted","Sprache 1:","DEU","durch ungültigen Sprachschlüssel ersetzen, wenn keine deutschen Texte übernommen werden sollen","Replace by an invalid language key if German descriptions are not wanted","Sprache 1:","DEU","durch ungültigen Sprachschlüssel ersetzen, wenn keine deutschen Texte übernommen werden sollen","Replace by an invalid language key if German descriptions are not wanted","Sprache 1:","DEU","durch ungültigen Sprachschlüssel ersetzen, wenn keine deutschen Texte übernommen werden sollen","Replace by an invalid language key if German descriptions are not wanted","Sprache 1:","DEU","durch ungültigen Sprachschlüssel ersetzen, wenn keine deutschen Texte übernommen werden sollen","Replace by an invalid language key if German descriptions are not wanted","Sprache 1:","DEU","durch ungültigen Sprachschlüssel ersetzen, wenn keine deutschen Texte übernommen werden sollen","Replace by an invalid language key if German descriptions are not wanted","Sprache 1:","DEU","durch ungültigen Sprachschlüssel ersetzen, wenn keine deutschen Texte übernommen werden sollen","Replace by an invalid language key if German descriptions are not wanted","Sprache 1:","DEU","durch ungültigen Sprachschlüssel ersetzen, wenn keine deutschen Texte übernommen werden sollen","Replace by an invalid language key if German descriptions are not wanted","Sprache 1:","DEU","durch ungültigen Sprachschlüssel ersetzen, wenn keine deutschen Texte übernommen werden sollen","Replace by an invalid language key if German descriptions are not wanted","Sprache 1:","DEU","durch ungültigen Sprachschlüssel ersetzen, wenn keine deutschen Texte übernommen werden sollen","Replace by an invalid language key if German descriptions are not wanted","Sprache 1:","DEU","durch ungültigen Sprachschlüssel ersetzen, wenn keine deutschen Texte übernommen werden sollen","Replace by an invalid language key if German descriptions are not wanted","Sprache 1:","DEU","durch ungültigen Sprachschlüssel ersetzen, wenn keine deutschen Texte übernommen werden sollen","Replace by an invalid language key if German descriptions are not wanted","Sprache 1:","DEU","durch ungültigen Sprachschlüssel ersetzen, wenn keine deutschen Texte übernommen werden sollen","Replace by an invalid language key if German descriptions are not wanted","Sprache 1:","DEU","durch ungültigen Sprachschlüssel ersetzen, wenn keine deutschen Texte übernommen werden sollen","Replace by an invalid language key if German descriptions are not wanted","Sprache 1:","DEU","durch ungültigen Sprachschlüssel ersetzen, wenn keine deutschen Texte übernommen werden sollen","Replace by an invalid language key if German descriptions are not wanted","Sprache 1:","DEU","durch ungültigen Sprachschlüssel ersetzen, wenn keine deutschen Texte übernommen werden sollen","Replace by an invalid language key if German descriptions are not wanted","Sprache 1:","DEU","durch ungültigen Sprachschlüssel ersetzen, wenn keine deutschen Texte übernommen werden sollen","Replace by an invalid language key if German descriptions are not wanted","Sprache 1:","DEU","durch ungültigen Sprachschlüssel ersetzen, wenn keine deutschen Texte übernommen werden sollen","Replace by an invalid language key if German descriptions are not wanted","Sprache 1:","DEU","durch ungültigen Sprachschlüssel ersetzen, wenn keine deutschen Texte übernommen werden sollen","Replace by an invalid language key if German descriptions are not wanted","Sprache 1:","DEU","durch ungültigen Sprachschlüssel ersetzen, wenn keine deutschen Texte übernommen werden sollen","Replace by an invalid language key if German descriptions are not wanted","Sprache 1:","DEU","durch ungültigen Sprachschlüssel ersetzen, wenn keine deutschen Texte übernommen werden sollen","Replace by an invalid language key if German descriptions are not wanted","Sprache 1:","DEU","durch ungültigen Sprachschlüssel ersetzen, wenn keine deutschen Texte übernommen werden sollen","Replace by an invalid language key if German descriptions are not wanted","Sprache 1:","DEU","durch ungültigen Sprachschlüssel ersetzen, wenn keine deutschen Texte übernommen werden sollen","Replace by an invalid language key if German descriptions are not wanted","Sprache 1:","DEU","durch ungültigen Sprachschlüssel ersetzen, wenn keine deutschen Texte übernommen werden sollen","Replace by an invalid language key if German descriptions are not wanted","Sprache 1:","DEU","durch ungültigen Sprachschlüssel ersetzen, wenn keine deutschen Texte übernommen werden sollen","Replace by an invalid language key if German descriptions are not wanted","Sprache 1:","DEU","durch ungültigen Sprachschlüssel ersetzen, wenn keine deutschen Texte übernommen werden sollen","Replace by an invalid language key if German descriptions are not wanted","Sprache 1:","DEU","durch ungültigen Sprachschlüssel ersetzen, wenn keine deutschen Texte übernommen werden sollen","Replace by an invalid language key if German descriptions are not wanted","Sprache 1:","DEU","durch ungültigen Sprachschlüssel ersetzen, wenn keine deutschen Texte übernommen werden sollen","Replace by an invalid language key if German descriptions are not wanted","Sprache 1:","DEU","durch ungültigen Sprachschlüssel ersetzen, wenn keine deutschen Texte übernommen werden sollen","Replace by an invalid language key if German descriptions are not wanted","Sprache 1:","DEU","durch ungültigen Sprachschlüssel ersetzen, wenn keine deutschen Texte übernommen werden sollen","Replace by an invalid language key if German descriptions are not wanted","Sprache 1:","DEU","durch ungültigen Sprachschlüssel ersetzen, wenn keine deutschen Texte übernommen werden sollen","Replace by an invalid language key if German descriptions are not wanted","Sprache 1:","DEU","durch ungültigen Sprachschlüssel ersetzen, wenn keine deutschen Texte übernommen werden sollen","Replace by an invalid language key if German descriptions are not wanted","Sprache 1:","DEU","durch ungültigen Sprachschlüssel ersetzen, wenn keine deutschen Texte übernommen werden sollen","Replace by an invalid language key if German descriptions are not wanted","Sprache 1:","DEU","durch ungültigen Sprachschlüssel ersetzen, wenn keine deutschen Texte übernommen werden sollen","Replace by an invalid language key if German descriptions are not wanted","Sprache 1:","DEU","durch ungültigen Sprachschlüssel ersetzen, wenn keine deutschen Texte übernommen werden sollen","Replace by an invalid language key if German descriptions are not wanted","Sprache 1:","DEU","durch ungültigen Sprachschlüssel ersetzen, wenn keine deutschen Texte übernommen werden sollen","Replace by an invalid language key if German descriptions are not wanted","Sprache 1:","DEU","durch ungültigen Sprachschlüssel ersetzen, wenn keine deutschen Texte übernommen werden sollen","Replace by an invalid language key if German descriptions are not wanted","Sprache 1:","DEU","durch ungültigen Sprachschlüssel ersetzen, wenn keine deutschen Texte übernommen werden sollen","Replace by an invalid language key if German descriptions are not wanted"]
["Gültig ab:","12.2012","Ersetzen durch die erste in der Anwendung verwendete Periode","Replace by the first period used in the application"]
["Positionsplan:","EKPOS","Ersetzen durch Schlüssel des Positionsplans für den Eigenkapitalspiegel","Replace by the key of the chart of positions for the capital report"]
[null,null,"Ein Positionsplan mit diesem Schlüssel muss vor dem Export der Positionen in IDLKONSIS mit Hilfe der Anwendung Positionspläne (POP) definiert werden, da es für diese Daten keine Exportmöglichkeit gibt.","A chart of positions with this key has to be defined in IDLKONSIS before export of positions with aid of the applicaiton Charts of positions (POP) since there is no Connector export available for these data."]
["Kontenplan:","EKKON","Ersetzen durch den konzerneinheitlichen Kontenplan","Replace by the group-wide chart of accounts"]
[null,null,"Ein Konzernkontenplan ist i.d.R. vorhanden. Sollte dies nicht der Fall sein, können die Referenzen auf der Seite <KTP> aktiviert werden, um einen Connector-Export nicht durchzuführen. Dazu ist das Hochkomma am Anfang des Zellinhalts vor dem Connector-Bezug zu entfernen.","A group chart of accounts usually is already defined. If not you can activate the references on the page <KTP> for providing a Connector export. For this purpose you have to remove the apostrophe at the beginning of the cell content in front of the Connector reference."]
["Report-Id:","EK","Ersetzen durch Schlüssel des Reports für den Eigenkapitalspiegel (Report-Typ = D, Spiegel = K bzw. anderer Schlüssel des Kapitalspiegels)","Replace by the key of the equity capital development report (report type = D, transaction development = K or an alternative key of the capital transaction development"]
[null,null,"Eine Report-Id mit diesem Schlüssel muss vor dem Export der Reportzeilen in IDLKONSIS mit Hilfe der Anwendung Report-Idents (RID) definiert werden, da es für diese Daten keine Exportmöglichkeit gibt.","A report ID with this key has to be defined in IDLKONSIS before export of report lines with aid of the application Report idents (RID) since there is no Connector export available for these data."]
["Kapitalspiegel:","K","Ersetzen durch den Schlüssel des Kapitalspiegels","Replace by the key of the equity capital transaction development"]

{"sheet":"POP","index":1,"n_rows":3,"n_cols":9,"rows_kept":3,"merged":[[0,6,0,7],[0,8,1,8],[0,9,1,9]]}
["Pos","Bezeichnung","Kurztext","T","CF","Anz","Gültig",null,"Bezug IDL.XLSLINK"]
["Plan","","","","Pos","Pos#","ab","bis",""]
[{"$f":"General!B4","v":"EKPOS"},"Positionsplan für Eigenkapitalspiegel","EK-Spiegel","A",null,null,{"$f":"ValidFrom","v":"12.2012"},null,{"$f":"IF(TRUE,\"STAGB\",_xll.IDLSetValue(_xll.IDLPara(1,\"STAGB\",Database,,,,,,,,,,,,,,,,H3,ValidFrom,Language1,,,,,B3,C3),_xll.IDLPara(2,General!B4,D3,F3,E3)))","v":"STAGB"}]

{"sheet":"POS","index":2,"n_rows":17,"n_cols":12,"rows_kept":17,"merged":[[0,5,1,5],[0,7,1,7],[0,9,0,10],[0,11,1,11]]}
["Position","Bezeichnung","Spalten-","Kurztext","Pos","B\nG","Dim","Davon\nPos","XBRL","Gültig",null,"Bezug IDL.XLSLINK"]
["","","überschrift","","Typ","","","","Concept","ab","bis",""]
["EK010","Mutterunternehmen - Gezeichnetes Kapital","Mutterunternehmen|Gezeichnetes|Kapital|","MutGezKap",null,"2",{"$nulls":3},{"$f":"ValidFrom","v":"12.2012"},null,{"$f":"IF(TRUE,\"STAGG\",_xll.IDLSetValue(_xll.IDLPara(1,\"STAGG\",Database,,,,,,,,,,,,,,General!$B$4,$A3,$K3,ValidFrom,Language1,,,,$E3,$B3,$D3),_xll.IDLPara(2,$C3,,$F3,$H3,$G3,$I3)))","v":"STAGG"}]
["EK020","Mutterunternehmen - Nicht eingeforderte ausstehende Einlage","Mutterunternehmen|Nicht eingeforderte|ausstehende Einlage|","MutAusEinl",null,"2",{"$nulls":3},"12.2012",null,{"$f":"IF(TRUE,\"STAGG\",_xll.IDLSetValue(_xll.IDLPara(1,\"STAGG\",Database,,,,,,,,,,,,,,General!$B$4,$A4,$K4,ValidFrom,Language1,,,,$E4,$B4,$D4),_xll.IDLPara(2,$C4,,$F4,$H4,$G4,$I4)))","v":"STAGG"}]
["EK030","Mutterunternehmen - Eigene Anteile","Mutterunternehmen|Eigene|Anteile|","MutEigAnt",null,"2",{"$nulls":3},"12.2012",null,{"$f":"IF(TRUE,\"STAGG\",_xll.IDLSetValue(_xll.IDLPara(1,\"STAGG\",Database,,,,,,,,,,,,,,General!$B$4,$A5,$K5,ValidFrom,Language1,,,,$E5,$B5,$D5),_xll.IDLPara(2,$C5,,$F5,$H5,$G5,$I5)))","v":"STAGG"}]
["EK040","Mutterunternehmen - Kapitalrücklage","Mutterunternehmen|Kapitalrücklage||","MutKapRück",null,"2",{"$nulls":3},"12.2012",null,{"$f":"IF(TRUE,\"STAGG\",_xll.IDLSetValue(_xll.IDLPara(1,\"STAGG\",Database,,,,,,,,,,,,,,General!$B$4,$A6,$K6,ValidFrom,Language1,,,,$E6,$B6,$D6),_xll.IDLPara(2,$C6,,$F6,$H6,$G6,$I6)))","v":"STAGG"}]
["EK050","Mutterunternehmen - Erwirtschaftetes Eigenkapital","Mutterunternehmen|Erwirtschaftetes|Eigenkapital|","MutErwEKap",null,"2",{"$nulls":3},"12.2012",null,{"$f":"IF(TRUE,\"STAGG\",_xll.IDLSetValue(_xll.IDLPara(1,\"STAGG\",Database,,,,,,,,,,,,,,General!$B$4,$A7,$K7,ValidFrom,Language1,,,,$E7,$B7,$D7),_xll.IDLPara(2,$C7,,$F7,$H7,$G7,$I7)))","v":"STAGG"}]
["EK060","Mutterunternehmen - Kumul. übriges Konzernerg. Währungsumrechnung","Mutterunternehmen|Kumul. übriges Konzernerg.|Währungs-|umrechnung","MutWhrgumr",null,"2",{"$nulls":3},"12.2012",null,{"$f":"IF(TRUE,\"STAGG\",_xll.IDLSetValue(_xll.IDLPara(1,\"STAGG\",Database,,,,,,,,,,,,,,General!$B$4,$A8,$K8,ValidFrom,Language1,,,,$E8,$B8,$D8),_xll.IDLPara(2,$C8,,$F8,$H8,$G8,$I8)))","v":"STAGG"}]
["EK070","Mutterunternehmen - Kumul. übriges Konzernerg. übrige neutr. Veränder.","Mutterunternehmen|Kumul. übriges Konzernerg.|übrige neutr.|Veränderung","MutNeutrV",null,"2",{"$nulls":3},"12.2012",null,{"$f":"IF(TRUE,\"STAGG\",_xll.IDLSetValue(_xll.IDLPara(1,\"STAGG\",Database,,,,,,,,,,,,,,General!$B$4,$A9,$K9,ValidFrom,Language1,,,,$E9,$B9,$D9),_xll.IDLPara(2,$C9,,$F9,$H9,$G9,$I9)))","v":"STAGG"}]
["EK080","Mutterunternehmen - Eigenkapital gem. Konzernbilanz","Mutterunternehmen|Eigenkapital|gem. Konzernbilanz|","MutEigKBil",null,"2",{"$nulls":3},"12.2012",null,{"$f":"IF(TRUE,\"STAGG\",_xll.IDLSetValue(_xll.IDLPara(1,\"STAGG\",Database,,,,,,,,,,,,,,General!$B$4,$A10,$K10,ValidFrom,Language1,,,,$E10,$B10,$D10),_xll.IDLPara(2,$C10,,$F10,$H10,$G10,$I10)))","v":"STAGG"}]
["EK090","Mutterunternehmen - Übrige eigene Anteile","Mutterunternehmen|Übrige|eigene Anteile|","MutÜbrAnt",null,"2",{"$nulls":3},"12.2012",null,{"$f":"IF(TRUE,\"STAGG\",_xll.IDLSetValue(_xll.IDLPara(1,\"STAGG\",Database,,,,,,,,,,,,,,General!$B$4,$A11,$K11,ValidFrom,Language1,,,,$E11,$B11,$D11),_xll.IDLPara(2,$C11,,$F11,$H11,$G11,$I11)))","v":"STAGG"}]
["EK100","Mutterunternehmen - Eigenkapital","Mutterunternehmen|Eigenkapital||","MutEigenk.",null,"2",{"$nulls":3},"12.2012",null,{"$f":"IF(TRUE,\"STAGG\",_xll.IDLSetValue(_xll.IDLPara(1,\"STAGG\",Database,,,,,,,,,,,,,,General!$B$4,$A12,$K12,ValidFrom,Language1,,,,$E12,$B12,$D12),_xll.IDLPara(2,$C12,,$F12,$H12,$G12,$I12)))","v":"STAGG"}]
["EK110","Minderheitsges. - Minderheitenkapital","Minderheitsges.|Minderheiten-|kapital|","MinKapital",null,"2",{"$nulls":3},"12.2012",null,{"$f":"IF(TRUE,\"STAGG\",_xll.IDLSetValue(_xll.IDLPara(1,\"STAGG\",Database,,,,,,,,,,,,,,General!$B$4,$A13,$K13,ValidFrom,Language1,,,,$E13,$B13,$D13),_xll.IDLPara(2,$C13,,$F13,$H13,$G13,$I13)))","v":"STAGG"}]
["EK120","Minderheitsges. - Kumul. übriges Konzernerg. Währungsumrechnung","Minderheitsges.|Kumul. übriges Konzernerg.|Währungs-|umrechnung","MinWhrgumr",null,"2",{"$nulls":3},"12.2012",null,{"$f":"IF(TRUE,\"STAGG\",_xll.IDLSetValue(_xll.IDLPara(1,\"STAGG\",Database,,,,,,,,,,,,,,General!$B$4,$A14,$K14,ValidFrom,Language1,,,,$E14,$B14,$D14),_xll.IDLPara(2,$C14,,$F14,$H14,$G14,$I14)))","v":"STAGG"}]
["EK130","Minderheitsges. - Kumul. übriges Konzernerg. übrige neutr. Veränderung","Minderheitsges.|Kumul. übriges Konzernerg.|übrige neutr.|Veränderung","MinKumErg",null,"2",{"$nulls":3},"12.2012",null,{"$f":"IF(TRUE,\"STAGG\",_xll.IDLSetValue(_xll.IDLPara(1,\"STAGG\",Database,,,,,,,,,,,,,,General!$B$4,$A15,$K15,ValidFrom,Language1,,,,$E15,$B15,$D15),_xll.IDLPara(2,$C15,,$F15,$H15,$G15,$I15)))","v":"STAGG"}]
["EK140","Minderheitsges. - Eigenkapital","Minderheitsges.|Eigenkapital||","MinEigenk.",null,"2",{"$nulls":3},"12.2012",null,{"$f":"IF(TRUE,\"STAGG\",_xll.IDLSetValue(_xll.IDLPara(1,\"STAGG\",Database,,,,,,,,,,,,,,General!$B$4,$A16,$K16,ValidFrom,Language1,,,,$E16,$B16,$D16),_xll.IDLPara(2,$C16,,$F16,$H16,$G16,$I16)))","v":"STAGG"}]
["EK150","Gesamt","Gesamt","Gesamt",null,"2",{"$nulls":3},"12.2012",null,{"$f":"IF(TRUE,\"STAGG\",_xll.IDLSetValue(_xll.IDLPara(1,\"STAGG\",Database,,,,,,,,,,,,,,General!$B$4,$A17,$K17,ValidFrom,Language1,,,,$E17,$B17,$D17),_xll.IDLPara(2,$C17,,$F17,$H17,$G17,$I17)))","v":"STAGG"}]

{"sheet":"KTP","index":3,"n_rows":3,"n_cols":13,"rows_kept":3,"merged":[[0,3,1,3],[0,5,1,5],[0,10,0,11],[0,12,1,12],[0,13,1,13],[0,14,1,14]]}
["Konten-","Bezeichnung","Kurztext","KK","ZuoKtp","T","Länge","P","RL","Ktp.GB","Gültig",null,"Bezug IDL.XLSLINK"]
["plan","","","",null,"","KtoNr","","Art",null,"ab","bis",""]
[{"$f":"General!B6","v":"EKKON"},"Konzern-Kontenplan","KonzernKtp","K",null,"K",null,"A",null,null,{"$f":"ValidFrom","v":"12.2012"},null,{"$f":"IF(TRUE,\"STKTP\",_xll.IDLSetValue(_xll.IDLPara(1,\"STKTP\",Database,,,,,,,$A3,$J3,,,,,,,,$L3,ValidFrom,Language1,,,,,$C3,$B3),_xll.IDLPara(2,$D3,$H3,$F3,$G3,,$E3,,,,,$I3)))","v":"STKTP"}]

{"sheet":"KTO","index":4,"n_rows":40,"n_cols":22,"rows_kept":40,"merged":[[0,3,2,3],[0,4,0,6],[0,7,2,7],[0,8,2,8],[0,9,0,11],[0,18,2,18],[0,19,0,20],[0,21,2,21],[1,4,2,4],[1,5,2,5],[1,6,2,6],[1,9,1,11],[2,9,2,9],[2,10,2,10],[2,11,2,11]]}
["Konto","Bezeichnung","Kurztext","B\nG","Konto-Kennzeichen",null,null,"Spie-\ngel","UB\nV","Verwendung","Verwendung","Verwendung","BSL","Controlling","KVA","RL","Plan","UB","Konto\nFremdanteil","Gültig",null,"Bezug IDL.XLSLINK"]
["","","","","K","IC","SGA","","","in Periode","in Periode","in Periode","Gru","Objekt","","Art",null,"KF","","ab","bis",""]
["","","","",{"$nulls":3},"","","M","Q","J",null,null,"",{"$nulls":3},""]
["30000","Nicht eingeforderte ausstehende Einlage auf das gezeichnete Kapital","NeuBewRL","2",{"$nulls":3},{"$f":"General!$B$10","v":"K"},null,"X","X","X",{"$nulls":7},{"$f":"ValidFrom","v":"12.2012"},null,{"$f":"IF(TRUE,\"STKTO\",_xll.IDLSetValue(_xll.IDLPara(1,\"STKTO\",Database,,,,,,,,General!$B$6,$A4,,,,,,,$U4,ValidFrom,Language1,,,,,$C4,$B4),_xll.IDLPara(2,,,$D4,$E4,$O4,,,,$I4,$R4,$P4,$K4,$J4,$L4,,,,,$S4,,$H4,,,$F4,$G4)))","v":"STKTO"}]
["30010","Gezeichnetes Kapital","Gez. Kap.","2",{"$nulls":3},{"$f":"General!$B$10","v":"K"},null,"X","X","X",{"$nulls":6},{"$f":"A$28","v":"3600K"},"12.2012",null,{"$f":"IF(TRUE,\"STKTO\",_xll.IDLSetValue(_xll.IDLPara(1,\"STKTO\",Database,,,,,,,,General!$B$6,$A5,,,,,,,$U5,ValidFrom,Language1,,,,,$C5,$B5),_xll.IDLPara(2,,,$D5,$E5,$O5,,,,$I5,$R5,$P5,$K5,$J5,$L5,,,,,$S5,,$H5,,,$F5,$G5)))","v":"STKTO"}]
["31010","Kapitalrücklage","Kap. Rück.","2",{"$nulls":3},{"$f":"General!$B$10","v":"K"},null,"X","X","X",{"$nulls":6},{"$f":"A$28","v":"3600K"},"12.2012",null,{"$f":"IF(TRUE,\"STKTO\",_xll.IDLSetValue(_xll.IDLPara(1,\"STKTO\",Database,,,,,,,,General!$B$6,$A6,,,,,,,$U6,ValidFrom,Language1,,,,,$C6,$B6),_xll.IDLPara(2,,,$D6,$E6,$O6,,,,$I6,$R6,$P6,$K6,$J6,$L6,,,,,$S6,,$H6,,,$F6,$G6)))","v":"STKTO"}]
["32010","Gesetzliche Rücklage","Ges. Rück.","2",{"$nulls":3},{"$f":"General!$B$10","v":"K"},null,"X","X","X",{"$nulls":6},{"$f":"A$28","v":"3600K"},"12.2012",null,{"$f":"IF(TRUE,\"STKTO\",_xll.IDLSetValue(_xll.IDLPara(1,\"STKTO\",Database,,,,,,,,General!$B$6,$A7,,,,,,,$U7,ValidFrom,Language1,,,,,$C7,$B7),_xll.IDLPara(2,,,$D7,$E7,$O7,,,,$I7,$R7,$P7,$K7,$J7,$L7,,,,,$S7,,$H7,,,$F7,$G7)))","v":"STKTO"}]
["32110","Rücklage für eigene Anteile","Eig. Rück.","2",{"$nulls":3},{"$f":"General!$B$10","v":"K"},null,"X","X","X",{"$nulls":6},"3600K","12.2012",null,{"$f":"IF(TRUE,\"STKTO\",_xll.IDLSetValue(_xll.IDLPara(1,\"STKTO\",Database,,,,,,,,General!$B$6,$A8,,,,,,,$U8,ValidFrom,Language1,,,,,$C8,$B8),_xll.IDLPara(2,,,$D8,$E8,$O8,,,,$I8,$R8,$P8,$K8,$J8,$L8,,,,,$S8,,$H8,,,$F8,$G8)))","v":"STKTO"}]
["32310","Andere Gewinnrücklagen","And. Rück.","2",{"$nulls":3},{"$f":"General!$B$10","v":"K"},null,"X","X","X",{"$nulls":6},"3600K","12.2012",null,{"$f":"IF(TRUE,\"STKTO\",_xll.IDLSetValue(_xll.IDLPara(1,\"STKTO\",Database,,,,,,,,General!$B$6,$A9,,,,,,,$U9,ValidFrom,Language1,,,,,$C9,$B9),_xll.IDLPara(2,,,$D9,$E9,$O9,,,,$I9,$R9,$P9,$K9,$J9,$L9,,,,,$S9,,$H9,,,$F9,$G9)))","v":"STKTO"}]
["32500","UB-Interimskonto","UB-Interim","2","T",null,null,{"$f":"General!$B$10","v":"K"},null,"X","X","X",{"$nulls":7},"12.2012",null,{"$f":"IF(TRUE,\"STKTO\",_xll.IDLSetValue(_xll.IDLPara(1,\"STKTO\",Database,,,,,,,,General!$B$6,$A10,,,,,,,$U10,ValidFrom,Language1,,,,,$C10,$B10),_xll.IDLPara(2,,,$D10,$E10,$O10,,,,$I10,$R10,$P10,$K10,$J10,$L10,,,,,$S10,,$H10,,,$F10,$G10)))","v":"STKTO"}]
["32510","Pass. UB aus Kapitalkonsolidierung","Pass. UB","2",{"$nulls":3},{"$f":"General!$B$10","v":"K"},null,"X","X","X",{"$nulls":7},"12.2012",null,{"$f":"IF(TRUE,\"STKTO\",_xll.IDLSetValue(_xll.IDLPara(1,\"STKTO\",Database,,,,,,,,General!$B$6,$A11,,,,,,,$U11,ValidFrom,Language1,,,,,$C11,$B11),_xll.IDLPara(2,,,$D11,$E11,$O11,,,,$I11,$R11,$P11,$K11,$J11,$L11,,,,,$S11,,$H11,,,$F11,$G11)))","v":"STKTO"}]
["33010","Ergebnisvortrag Einzelgesellschaft","Erg. Vort.","2","X",null,null,{"$f":"General!$B$10","v":"K"},null,"X","X","X",{"$nulls":6},{"$f":"A$28","v":"3600K"},"12.2012",null,{"$f":"IF(TRUE,\"STKTO\",_xll.IDLSetValue(_xll.IDLPara(1,\"STKTO\",Database,,,,,,,,General!$B$6,$A12,,,,,,,$U12,ValidFrom,Language1,,,,,$C12,$B12),_xll.IDLPara(2,,,$D12,$E12,$O12,,,,$I12,$R12,$P12,$K12,$J12,$L12,,,,,$S12,,$H12,,,$F12,$G12)))","v":"STKTO"}]
["3302K","Ergebnisvortrag Unt. HB II zu StB","ErgVortStB","2","C",null,null,{"$f":"General!$B$10","v":"K"},null,"X","X","X",{"$nulls":6},"3600K","12.2012",null,{"$f":"IF(TRUE,\"STKTO\",_xll.IDLSetValue(_xll.IDLPara(1,\"STKTO\",Database,,,,,,,,General!$B$6,$A13,,,,,,,$U13,ValidFrom,Language1,,,,,$C13,$B13),_xll.IDLPara(2,,,$D13,$E13,$O13,,,,$I13,$R13,$P13,$K13,$J13,$L13,,,,,$S13,,$H13,,,$F13,$G13)))","v":"STKTO"}]
["3303K","Ergebnisvortrag Equity","Erg. Vort.","2","C",null,null,{"$f":"General!$B$10","v":"K"},null,"X","X","X",{"$nulls":6},"3600K","12.2012",null,{"$f":"IF(TRUE,\"STKTO\",_xll.IDLSetValue(_xll.IDLPara(1,\"STKTO\",Database,,,,,,,,General!$B$6,$A14,,,,,,,$U14,ValidFrom,Language1,,,,,$C14,$B14),_xll.IDLPara(2,,,$D14,$E14,$O14,,,,$I14,$R14,$P14,$K14,$J14,$L14,,,,,$S14,,$H14,,,$F14,$G14)))","v":"STKTO"}]
["33510","Gewinnausschüttung","Gew.Aus.","2",null,"J",null,{"$f":"General!$B$10","v":"K"},"X","X","X","X",null,null,"SD",{"$nulls":3},"3600K","12.2012",null,{"$f":"IF(TRUE,\"STKTO\",_xll.IDLSetValue(_xll.IDLPara(1,\"STKTO\",Database,,,,,,,,General!$B$6,$A15,,,,,,,$U15,ValidFrom,Language1,,,,,$C15,$B15),_xll.IDLPara(2,,,$D15,$E15,$O15,,,,$I15,$R15,$P15,$K15,$J15,$L15,,,,,$S15,,$H15,,,$F15,$G15)))","v":"STKTO"}]
["33520","Garantiedividende","Garantiedi","2",null,"J",null,{"$f":"General!$B$10","v":"K"},"X","X","X","X",null,null,"SD",{"$nulls":3},"3600K","12.2012",null,{"$f":"IF(TRUE,\"STKTO\",_xll.IDLSetValue(_xll.IDLPara(1,\"STKTO\",Database,,,,,,,,General!$B$6,$A16,,,,,,,$U16,ValidFrom,Language1,,,,,$C16,$B16),_xll.IDLPara(2,,,$D16,$E16,$O16,,,,$I16,$R16,$P16,$K16,$J16,$L16,,,,,$S16,,$H16,,,$F16,$G16)))","v":"STKTO"}]
["3400K","Jahresüberschuss / Jahresfehlbetrag (vor Anteile Fremder)","JÜ","2","E",null,null,{"$f":"General!$B$10","v":"K"},"X",{"$nulls":9},{"$f":"A$29","v":"3610K"},"12.2012",null,{"$f":"IF(TRUE,\"STKTO\",_xll.IDLSetValue(_xll.IDLPara(1,\"STKTO\",Database,,,,,,,,General!$B$6,$A17,,,,,,,$U17,ValidFrom,Language1,,,,,$C17,$B17),_xll.IDLPara(2,,,$D17,$E17,$O17,,,,$I17,$R17,$P17,$K17,$J17,$L17,,,,,$S17,,$H17,,,$F17,$G17)))","v":"STKTO"}]
["3410K","JÜ-Anteil fremde Gesellschafter (GuV)","JÜ fremd","2",{"$nulls":3},{"$f":"General!$B$10","v":"K"},"X","X","X","X",{"$nulls":7},"12.2012",null,{"$f":"IF(TRUE,\"STKTO\",_xll.IDLSetValue(_xll.IDLPara(1,\"STKTO\",Database,,,,,,,,General!$B$6,$A18,,,,,,,$U18,ValidFrom,Language1,,,,,$C18,$B18),_xll.IDLPara(2,,,$D18,$E18,$O18,,,,$I18,$R18,$P18,$K18,$J18,$L18,,,,,$S18,,$H18,,,$F18,$G18)))","v":"STKTO"}]
["3420K","Bei Erstkonsolidierung einbezogener Jahresüberschuss","JÜ-Elim.KM","2",{"$nulls":3},{"$f":"General!$B$10","v":"K"},"X","X","X","X",{"$nulls":6},"3610K","12.2012",null,{"$f":"IF(TRUE,\"STKTO\",_xll.IDLSetValue(_xll.IDLPara(1,\"STKTO\",Database,,,,,,,,General!$B$6,$A19,,,,,,,$U19,ValidFrom,Language1,,,,,$C19,$B19),_xll.IDLPara(2,,,$D19,$E19,$O19,,,,$I19,$R19,$P19,$K19,$J19,$L19,,,,,$S19,,$H19,,,$F19,$G19)))","v":"STKTO"}]
["3500K","Ausgleichsposten Währungsumrechnung Bilanz (KW)","AGP WUM","2",{"$nulls":3},{"$f":"General!$B$10","v":"K"},null,"X","X","X",{"$nulls":6},{"$f":"A$30","v":"3620K"},"12.2012",null,{"$f":"IF(TRUE,\"STKTO\",_xll.IDLSetValue(_xll.IDLPara(1,\"STKTO\",Database,,,,,,,,General!$B$6,$A20,,,,,,,$U20,ValidFrom,Language1,,,,,$C20,$B20),_xll.IDLPara(2,,,$D20,$E20,$O20,,,,$I20,$R20,$P20,$K20,$J20,$L20,,,,,$S20,,$H20,,,$F20,$G20)))","v":"STKTO"}]
["3501K","Ausgleichsposten Währungsumrechnung Bilanz (PW)","AGP WUM","2",{"$nulls":3},{"$f":"General!$B$10","v":"K"},null,"X","X","X",{"$nulls":6},{"$f":"A$30","v":"3620K"},"12.2012",null,{"$f":"IF(TRUE,\"STKTO\",_xll.IDLSetValue(_xll.IDLPara(1,\"STKTO\",Database,,,,,,,,General!$B$6,$A21,,,,,,,$U21,ValidFrom,Language1,,,,,$C21,$B21),_xll.IDLPara(2,,,$D21,$E21,$O21,,,,$I21,$R21,$P21,$K21,$J21,$L21,,,,,$S21,,$H21,,,$F21,$G21)))","v":"STKTO"}]
["3502K","Ausgleichsposten Währungsumrechnung GuV (KW)","Ausgleichs","2",{"$nulls":3},{"$f":"General!$B$10","v":"K"},null,"X","X","X",{"$nulls":6},{"$f":"A$31","v":"3630K"},"12.2012",null,{"$f":"IF(TRUE,\"STKTO\",_xll.IDLSetValue(_xll.IDLPara(1,\"STKTO\",Database,,,,,,,,General!$B$6,$A22,,,,,,,$U22,ValidFrom,Language1,,,,,$C22,$B22),_xll.IDLPara(2,,,$D22,$E22,$O22,,,,$I22,$R22,$P22,$K22,$J22,$L22,,,,,$S22,,$H22,,,$F22,$G22)))","v":"STKTO"}]
["3503K","Ausgleichsposten Währungsumrechnung GuV (PW)","Ausgleichs","2",{"$nulls":3},{"$f":"General!$B$10","v":"K"},null,"X","X","X",{"$nulls":6},{"$f":"A$31","v":"3630K"},"12.2012",null,{"$f":"IF(TRUE,\"STKTO\",_xll.IDLSetValue(_xll.IDLPara(1,\"STKTO\",Database,,,,,,,,General!$B$6,$A23,,,,,,,$U23,ValidFrom,Language1,,,,,$C23,$B23),_xll.IDLPara(2,,,$D23,$E23,$O23,,,,$I23,$R23,$P23,$K23,$J23,$L23,,,,,$S23,,$H23,,,$F23,$G23)))","v":"STKTO"}]
["3504K","EF Währungseffekte Eigenkapital","EF Währung","2",{"$nulls":3},{"$f":"General!$B$10","v":"K"},null,"X","X","X",{"$nulls":6},{"$f":"A$30","v":"3620K"},"12.2012",null,{"$f":"IF(TRUE,\"STKTO\",_xll.IDLSetValue(_xll.IDLPara(1,\"STKTO\",Database,,,,,,,,General!$B$6,$A24,,,,,,,$U24,ValidFrom,Language1,,,,,$C24,$B24),_xll.IDLPara(2,,,$D24,$E24,$O24,,,,$I24,$R24,$P24,$K24,$J24,$L24,,,,,$S24,,$H24,,,$F24,$G24)))","v":"STKTO"}]
["3505K","EF Währungseffekte Goodwill","EF Währung","2",{"$nulls":3},{"$f":"General!$B$10","v":"K"},null,"X","X","X",{"$nulls":6},{"$f":"A$30","v":"3620K"},"12.2012",null,{"$f":"IF(TRUE,\"STKTO\",_xll.IDLSetValue(_xll.IDLPara(1,\"STKTO\",Database,,,,,,,,General!$B$6,$A25,,,,,,,$U25,ValidFrom,Language1,,,,,$C25,$B25),_xll.IDLPara(2,,,$D25,$E25,$O25,,,,$I25,$R25,$P25,$K25,$J25,$L25,,,,,$S25,,$H25,,,$F25,$G25)))","v":"STKTO"}]
["3506K","EF Währungseffekte Jahresergebnis","EF Währung","2",{"$nulls":3},{"$f":"General!$B$10","v":"K"},null,"X","X","X",{"$nulls":6},"3620K","12.2012",null,{"$f":"IF(TRUE,\"STKTO\",_xll.IDLSetValue(_xll.IDLPara(1,\"STKTO\",Database,,,,,,,,General!$B$6,$A26,,,,,,,$U26,ValidFrom,Language1,,,,,$C26,$B26),_xll.IDLPara(2,,,$D26,$E26,$O26,,,,$I26,$R26,$P26,$K26,$J26,$L26,,,,,$S26,,$H26,,,$F26,$G26)))","v":"STKTO"}]
["35500","Neubewertungsrücklage","NeuBewRL","2",{"$nulls":3},{"$f":"General!$B$10","v":"K"},null,"X","X","X",{"$nulls":6},{"$f":"A$32","v":"3650K"},"12.2012",null,{"$f":"IF(TRUE,\"STKTO\",_xll.IDLSetValue(_xll.IDLPara(1,\"STKTO\",Database,,,,,,,,General!$B$6,$A27,,,,,,,$U27,ValidFrom,Language1,,,,,$C27,$B27),_xll.IDLPara(2,,,$D27,$E27,$O27,,,,$I27,$R27,$P27,$K27,$J27,$L27,,,,,$S27,,$H27,,,$F27,$G27)))","v":"STKTO"}]
["3600K","Fremdanteile am Kapital und am Gewinnvortrag","Fremdantei","2",{"$nulls":3},{"$f":"General!$B$10","v":"K"},null,"X","X","X",{"$nulls":7},"12.2012",null,{"$f":"IF(TRUE,\"STKTO\",_xll.IDLSetValue(_xll.IDLPara(1,\"STKTO\",Database,,,,,,,,General!$B$6,$A28,,,,,,,$U28,ValidFrom,Language1,,,,,$C28,$B28),_xll.IDLPara(2,,,$D28,$E28,$O28,,,,$I28,$R28,$P28,$K28,$J28,$L28,,,,,$S28,,$H28,,,$F28,$G28)))","v":"STKTO"}]
["3610K","Fremdanteile am Jahresüberschuss","Fremdantei","2","F",null,null,{"$f":"General!$B$10","v":"K"},null,"X","X","X",{"$nulls":7},"12.2012",null,{"$f":"IF(TRUE,\"STKTO\",_xll.IDLSetValue(_xll.IDLPara(1,\"STKTO\",Database,,,,,,,,General!$B$6,$A29,,,,,,,$U29,ValidFrom,Language1,,,,,$C29,$B29),_xll.IDLPara(2,,,$D29,$E29,$O29,,,,$I29,$R29,$P29,$K29,$J29,$L29,,,,,$S29,,$H29,,,$F29,$G29)))","v":"STKTO"}]
["3620K","Fremdanteile am Ausgleichsposten Währungsumrechnung Bilanz","Fremdantei","2",{"$nulls":3},{"$f":"General!$B$10","v":"K"},null,"X","X","X",{"$nulls":7},"12.2012",null,{"$f":"IF(TRUE,\"STKTO\",_xll.IDLSetValue(_xll.IDLPara(1,\"STKTO\",Database,,,,,,,,General!$B$6,$A30,,,,,,,$U30,ValidFrom,Language1,,,,,$C30,$B30),_xll.IDLPara(2,,,$D30,$E30,$O30,,,,$I30,$R30,$P30,$K30,$J30,$L30,,,,,$S30,,$H30,,,$F30,$G30)))","v":"STKTO"}]
["3630K","Fremdanteile am Ausgleichsposten Währungsumrechnung GuV","Fremdantei","2",{"$nulls":3},{"$f":"General!$B$10","v":"K"},null,"X","X","X",{"$nulls":7},"12.2012",null,{"$f":"IF(TRUE,\"STKTO\",_xll.IDLSetValue(_xll.IDLPara(1,\"STKTO\",Database,,,,,,,,General!$B$6,$A31,,,,,,,$U31,ValidFrom,Language1,,,,,$C31,$B31),_xll.IDLPara(2,,,$D31,$E31,$O31,,,,$I31,$R31,$P31,$K31,$J31,$L31,,,,,$S31,,$H31,,,$F31,$G31)))","v":"STKTO"}]
["3650K","Fremdanteile an der Neubewertungsrücklage","Fremdantei","2",{"$nulls":3},{"$f":"General!$B$10","v":"K"},null,"X","X","X",{"$nulls":7},"12.2012",null,{"$f":"IF(TRUE,\"STKTO\",_xll.IDLSetValue(_xll.IDLPara(1,\"STKTO\",Database,,,,,,,,General!$B$6,$A32,,,,,,,$U32,ValidFrom,Language1,,,,,$C32,$B32),_xll.IDLPara(2,,,$D32,$E32,$O32,,,,$I32,$R32,$P32,$K32,$J32,$L32,,,,,$S32,,$H32,,,$F32,$G32)))","v":"STKTO"}]
["90010","Entnahme aus der Kapitalrücklage","Ent.KapRü","2",{"$nulls":3},{"$f":"General!$B$10","v":"K"},"X","X","X","X",{"$nulls":7},"12.2012",null,{"$f":"IF(TRUE,\"STKTO\",_xll.IDLSetValue(_xll.IDLPara(1,\"STKTO\",Database,,,,,,,,General!$B$6,$A33,,,,,,,$U33,ValidFrom,Language1,,,,,$C33,$B33),_xll.IDLPara(2,,,$D33,$E33,$O33,,,,$I33,$R33,$P33,$K33,$J33,$L33,,,,,$S33,,$H33,,,$F33,$G33)))","v":"STKTO"}]
["90011","Einstellung in die Kapitalrücklage","Ein.KapRü","2",{"$nulls":3},{"$f":"General!$B$10","v":"K"},"X","X","X","X",{"$nulls":7},"12.2012",null,{"$f":"IF(TRUE,\"STKTO\",_xll.IDLSetValue(_xll.IDLPara(1,\"STKTO\",Database,,,,,,,,General!$B$6,$A34,,,,,,,$U34,ValidFrom,Language1,,,,,$C34,$B34),_xll.IDLPara(2,,,$D34,$E34,$O34,,,,$I34,$R34,$P34,$K34,$J34,$L34,,,,,$S34,,$H34,,,$F34,$G34)))","v":"STKTO"}]
["90020","Entnahme aus der gesetzliche Rücklage","Ent.GesRü","2",{"$nulls":3},{"$f":"General!$B$10","v":"K"},"X","X","X","X",{"$nulls":7},"12.2012",null,{"$f":"IF(TRUE,\"STKTO\",_xll.IDLSetValue(_xll.IDLPara(1,\"STKTO\",Database,,,,,,,,General!$B$6,$A35,,,,,,,$U35,ValidFrom,Language1,,,,,$C35,$B35),_xll.IDLPara(2,,,$D35,$E35,$O35,,,,$I35,$R35,$P35,$K35,$J35,$L35,,,,,$S35,,$H35,,,$F35,$G35)))","v":"STKTO"}]
["90021","Einstellung in die gesetzliche Rücklage","Ein.GesRü","2",{"$nulls":3},{"$f":"General!$B$10","v":"K"},"X","X","X","X",{"$nulls":7},"12.2012",null,{"$f":"IF(TRUE,\"STKTO\",_xll.IDLSetValue(_xll.IDLPara(1,\"STKTO\",Database,,,,,,,,General!$B$6,$A36,,,,,,,$U36,ValidFrom,Language1,,,,,$C36,$B36),_xll.IDLPara(2,,,$D36,$E36,$O36,,,,$I36,$R36,$P36,$K36,$J36,$L36,,,,,$S36,,$H36,,,$F36,$G36)))","v":"STKTO"}]
["90030","Entnahme aus der Rücklage für eigene Anteile","Ent.EigAnt","2",{"$nulls":3},{"$f":"General!$B$10","v":"K"},"X","X","X","X",{"$nulls":7},"12.2012",null,{"$f":"IF(TRUE,\"STKTO\",_xll.IDLSetValue(_xll.IDLPara(1,\"STKTO\",Database,,,,,,,,General!$B$6,$A37,,,,,,,$U37,ValidFrom,Language1,,,,,$C37,$B37),_xll.IDLPara(2,,,$D37,$E37,$O37,,,,$I37,$R37,$P37,$K37,$J37,$L37,,,,,$S37,,$H37,,,$F37,$G37)))","v":"STKTO"}]
["90031","Einstellung in die Rücklage für eigene Anteile","Ein.EigAnt","2",{"$nulls":3},{"$f":"General!$B$10","v":"K"},"X","X","X","X",{"$nulls":7},"12.2012",null,{"$f":"IF(TRUE,\"STKTO\",_xll.IDLSetValue(_xll.IDLPara(1,\"STKTO\",Database,,,,,,,,General!$B$6,$A38,,,,,,,$U38,ValidFrom,Language1,,,,,$C38,$B38),_xll.IDLPara(2,,,$D38,$E38,$O38,,,,$I38,$R38,$P38,$K38,$J38,$L38,,,,,$S38,,$H38,,,$F38,$G38)))","v":"STKTO"}]
["90050","Entnahme aus den anderen Gewinnrücklagen","Ent.AndRü","2",{"$nulls":3},{"$f":"General!$B$10","v":"K"},"X","X","X","X",{"$nulls":7},"12.2012",null,{"$f":"IF(TRUE,\"STKTO\",_xll.IDLSetValue(_xll.IDLPara(1,\"STKTO\",Database,,,,,,,,General!$B$6,$A39,,,,,,,$U39,ValidFrom,Language1,,,,,$C39,$B39),_xll.IDLPara(2,,,$D39,$E39,$O39,,,,$I39,$R39,$P39,$K39,$J39,$L39,,,,,$S39,,$H39,,,$F39,$G39)))","v":"STKTO"}]
["90051","Einstellung in die anderen Gewinnrücklagen","Ein.AndRü","2",{"$nulls":3},{"$f":"General!$B$10","v":"K"},"X","X","X","X",{"$nulls":7},"12.2012",null,{"$f":"IF(TRUE,\"STKTO\",_xll.IDLSetValue(_xll.IDLPara(1,\"STKTO\",Database,,,,,,,,General!$B$6,$A40,,,,,,,$U40,ValidFrom,Language1,,,,,$C40,$B40),_xll.IDLPara(2,,,$D40,$E40,$O40,,,,$I40,$R40,$P40,$K40,$J40,$L40,,,,,$S40,,$H40,,,$F40,$G40)))","v":"STKTO"}]

{"sheet":"POSKTO","index":5,"n_rows":50,"n_cols":7,"rows_kept":50,"merged":[[0,4,0,5],[0,6,1,6]]}
["Position","Bezeichnung","S","C1","Gültig",null,"Bezug IDL.XLSLINK"]
["Konto","","H","","ab","bis",""]
[{"$f":"General!B4","v":"EKPOS"},{"$f":"POP!B3","v":"Positionsplan für Eigenkapitalspiegel"}]
[{"$f":"POS!A3","v":"EK010"},{"$f":"POS!B3","v":"Mutterunternehmen - Gezeichnetes Kapital"}]
[{"$f":"KTO!A5","v":"30010"},{"$f":"KTO!B5","v":"Gezeichnetes Kapital"},null,null,{"$f":"ValidFrom","v":"12.2012"},null,{"$f":"IF(TRUE,\"STAGGKTO\",_xll.IDLSetValue(_xll.IDLPara(1,\"STAGGKTO\",Database,,,,,,,,General!$B$6,$A5,,,,,General!$B$4,$A4),_xll.IDLPara(2,,,$D5,,,ValidFrom,$F5),_xll.IDLPara(3,,,,,$C5)))","v":"STAGGKTO"}]
[{"$f":"POS!A4","v":"EK020"},{"$f":"POS!B4","v":"Mutterunternehmen - Nicht eingeforderte ausstehende Einlage"}]
[{"$f":"KTO!A4","v":"30000"},{"$f":"KTO!B4","v":"Nicht eingeforderte ausstehende Einlage auf das gezeichnete Kapital"},null,null,{"$f":"ValidFrom","v":"12.2012"},null,{"$f":"IF(TRUE,\"STAGGKTO\",_xll.IDLSetValue(_xll.IDLPara(1,\"STAGGKTO\",Database,,,,,,,,General!$B$6,$A7,,,,,General!$B$4,$A6),_xll.IDLPara(2,,,$D7,,,ValidFrom,$F7),_xll.IDLPara(3,,,,,$C7)))","v":"STAGGKTO"}]
[{"$f":"POS!A5","v":"EK030"},{"$f":"POS!B5","v":"Mutterunternehmen - Eigene Anteile"}]
[{"$f":"KTO!A8","v":"32110"},{"$f":"KTO!B8","v":"Rücklage für eigene Anteile"},null,null,{"$f":"ValidFrom","v":"12.2012"},null,{"$f":"IF(TRUE,\"STAGGKTO\",_xll.IDLSetValue(_xll.IDLPara(1,\"STAGGKTO\",Database,,,,,,,,General!$B$6,$A9,,,,,General!$B$4,$A8),_xll.IDLPara(2,,,$D9,,,ValidFrom,$F9),_xll.IDLPara(3,,,,,$C9)))","v":"STAGGKTO"}]
[{"$f":"POS!A6","v":"EK040"},{"$f":"POS!B6","v":"Mutterunternehmen - Kapitalrücklage"}]
[{"$f":"KTO!A6","v":"31010"},{"$f":"KTO!B6","v":"Kapitalrücklage"},null,null,{"$f":"ValidFrom","v":"12.2012"},null,{"$f":"IF(TRUE,\"STAGGKTO\",_xll.IDLSetValue(_xll.IDLPara(1,\"STAGGKTO\",Database,,,,,,,,General!$B$6,$A11,,,,,General!$B$4,$A10),_xll.IDLPara(2,,,$D11,,,ValidFrom,$F11),_xll.IDLPara(3,,,,,$C11)))","v":"STAGGKTO"}]
[{"$f":"POS!A7","v":"EK050"},{"$f":"POS!B7","v":"Mutterunternehmen - Erwirtschaftetes Eigenkapital"}]
[{"$f":"KTO!A7","v":"32010"},{"$f":"KTO!B7","v":"Gesetzliche Rücklage"},null,null,{"$f":"ValidFrom","v":"12.2012"},null,{"$f":"IF(TRUE,\"STAGGKTO\",_xll.IDLSetValue(_xll.IDLPara(1,\"STAGGKTO\",Database,,,,,,,,General!$B$6,$A13,,,,,General!$B$4,$A$12),_xll.IDLPara(2,,,$D13,,,ValidFrom,$F13),_xll.IDLPara(3,,,,,$C13)))","v":"STAGGKTO"}]
[{"$f":"KTO!A9","v":"32310"},{"$f":"KTO!B9","v":"Andere Gewinnrücklagen"},null,null,"12.2012",null,{"$f":"IF(TRUE,\"STAGGKTO\",_xll.IDLSetValue(_xll.IDLPara(1,\"STAGGKTO\",Database,,,,,,,,General!$B$6,$A14,,,,,General!$B$4,$A$12),_xll.IDLPara(2,,,$D14,,,ValidFrom,$F14),_xll.IDLPara(3,,,,,$C14)))","v":"STAGGKTO"}]
[{"$f":"KTO!A10","v":"32500"},{"$f":"KTO!B10","v":"UB-Interimskonto"},null,null,"12.2012",null,{"$f":"IF(TRUE,\"STAGGKTO\",_xll.IDLSetValue(_xll.IDLPara(1,\"STAGGKTO\",Database,,,,,,,,General!$B$6,$A15,,,,,General!$B$4,$A$12),_xll.IDLPara(2,,,$D15,,,ValidFrom,$F15),_xll.IDLPara(3,,,,,$C15)))","v":"STAGGKTO"}]
[{"$f":"KTO!A11","v":"32510"},{"$f":"KTO!B11","v":"Pass. UB aus Kapitalkonsolidierung"},null,null,"12.2012",null,{"$f":"IF(TRUE,\"STAGGKTO\",_xll.IDLSetValue(_xll.IDLPara(1,\"STAGGKTO\",Database,,,,,,,,General!$B$6,$A16,,,,,General!$B$4,$A$12),_xll.IDLPara(2,,,$D16,,,ValidFrom,$F16),_xll.IDLPara(3,,,,,$C16)))","v":"STAGGKTO"}]
[{"$f":"KTO!A12","v":"33010"},{"$f":"KTO!B12","v":"Ergebnisvortrag Einzelgesellschaft"},null,null,"12.2012",null,{"$f":"IF(TRUE,\"STAGGKTO\",_xll.IDLSetValue(_xll.IDLPara(1,\"STAGGKTO\",Database,,,,,,,,General!$B$6,$A17,,,,,General!$B$4,$A$12),_xll.IDLPara(2,,,$D17,,,ValidFrom,$F17),_xll.IDLPara(3,,,,,$C17)))","v":"STAGGKTO"}]
[{"$f":"KTO!A13","v":"3302K"},{"$f":"KTO!B13","v":"Ergebnisvortrag Unt. HB II zu StB"},null,null,"12.2012",null,{"$f":"IF(TRUE,\"STAGGKTO\",_xll.IDLSetValue(_xll.IDLPara(1,\"STAGGKTO\",Database,,,,,,,,General!$B$6,$A18,,,,,General!$B$4,$A$12),_xll.IDLPara(2,,,$D18,,,ValidFrom,$F18),_xll.IDLPara(3,,,,,$C18)))","v":"STAGGKTO"}]
[{"$f":"KTO!A14","v":"3303K"},{"$f":"KTO!B14","v":"Ergebnisvortrag Equity"},null,null,"12.2012",null,{"$f":"IF(TRUE,\"STAGGKTO\",_xll.IDLSetValue(_xll.IDLPara(1,\"STAGGKTO\",Database,,,,,,,,General!$B$6,$A19,,,,,General!$B$4,$A$12),_xll.IDLPara(2,,,$D19,,,ValidFrom,$F19),_xll.IDLPara(3,,,,,$C19)))","v":"STAGGKTO"}]
[{"$f":"KTO!A15","v":"33510"},{"$f":"KTO!B15","v":"Gewinnausschüttung"},null,null,"12.2012",null,{"$f":"IF(TRUE,\"STAGGKTO\",_xll.IDLSetValue(_xll.IDLPara(1,\"STAGGKTO\",Database,,,,,,,,General!$B$6,$A20,,,,,General!$B$4,$A$12),_xll.IDLPara(2,,,$D20,,,ValidFrom,$F20),_xll.IDLPara(3,,,,,$C20)))","v":"STAGGKTO"}]
[{"$f":"KTO!A16","v":"33520"},{"$f":"KTO!B16","v":"Garantiedividende"},null,null,"12.2012",null,{"$f":"IF(TRUE,\"STAGGKTO\",_xll.IDLSetValue(_xll.IDLPara(1,\"STAGGKTO\",Database,,,,,,,,General!$B$6,$A21,,,,,General!$B$4,$A$12),_xll.IDLPara(2,,,$D21,,,ValidFrom,$F21),_xll.IDLPara(3,,,,,$C21)))","v":"STAGGKTO"}]
[{"$f":"KTO!A17","v":"3400K"},{"$f":"KTO!B17","v":"Jahresüberschuss / Jahresfehlbetrag (vor Anteile Fremder)"},null,null,"12.2012",null,{"$f":"IF(TRUE,\"STAGGKTO\",_xll.IDLSetValue(_xll.IDLPara(1,\"STAGGKTO\",Database,,,,,,,,General!$B$6,$A22,,,,,General!$B$4,$A$12),_xll.IDLPara(2,,,$D22,,,ValidFrom,$F22),_xll.IDLPara(3,,,,,$C22)))","v":"STAGGKTO"}]
[{"$f":"KTO!A18","v":"3410K"},{"$f":"KTO!B18","v":"JÜ-Anteil fremde Gesellschafter (GuV)"},null,null,"12.2012",null,{"$f":"IF(TRUE,\"STAGGKTO\",_xll.IDLSetValue(_xll.IDLPara(1,\"STAGGKTO\",Database,,,,,,,,General!$B$6,$A23,,,,,General!$B$4,$A$12),_xll.IDLPara(2,,,$D23,,,ValidFrom,$F23),_xll.IDLPara(3,,,,,$C23)))","v":"STAGGKTO"}]
[{"$f":"KTO!A19","v":"3420K"},{"$f":"KTO!B19","v":"Bei Erstkonsolidierung einbezogener Jahresüberschuss"},null,null,"12.2012",null,{"$f":"IF(TRUE,\"STAGGKTO\",_xll.IDLSetValue(_xll.IDLPara(1,\"STAGGKTO\",Database,,,,,,,,General!$B$6,$A24,,,,,General!$B$4,$A$12),_xll.IDLPara(2,,,$D24,,,ValidFrom,$F24),_xll.IDLPara(3,,,,,$C24)))","v":"STAGGKTO"}]
[{"$f":"KTO!A33","v":"90010"},{"$f":"KTO!B33","v":"Entnahme aus der Kapitalrücklage"},null,null,"12.2012",null,{"$f":"IF(TRUE,\"STAGGKTO\",_xll.IDLSetValue(_xll.IDLPara(1,\"STAGGKTO\",Database,,,,,,,,General!$B$6,$A25,,,,,General!$B$4,$A$12),_xll.IDLPara(2,,,$D25,,,ValidFrom,$F25),_xll.IDLPara(3,,,,,$C25)))","v":"STAGGKTO"}]
[{"$f":"KTO!A34","v":"90011"},{"$f":"KTO!B34","v":"Einstellung in die Kapitalrücklage"},null,null,"12.2012",null,{"$f":"IF(TRUE,\"STAGGKTO\",_xll.IDLSetValue(_xll.IDLPara(1,\"STAGGKTO\",Database,,,,,,,,General!$B$6,$A26,,,,,General!$B$4,$A$12),_xll.IDLPara(2,,,$D26,,,ValidFrom,$F26),_xll.IDLPara(3,,,,,$C26)))","v":"STAGGKTO"}]
[{"$f":"KTO!A35","v":"90020"},{"$f":"KTO!B35","v":"Entnahme aus der gesetzliche Rücklage"},null,null,"12.2012",null,{"$f":"IF(TRUE,\"STAGGKTO\",_xll.IDLSetValue(_xll.IDLPara(1,\"STAGGKTO\",Database,,,,,,,,General!$B$6,$A27,,,,,General!$B$4,$A$12),_xll.IDLPara(2,,,$D27,,,ValidFrom,$F27),_xll.IDLPara(3,,,,,$C27)))","v":"STAGGKTO"}]
[{"$f":"KTO!A36","v":"90021"},{"$f":"KTO!B36","v":"Einstellung in die gesetzliche Rücklage"},null,null,"12.2012",null,{"$f":"IF(TRUE,\"STAGGKTO\",_xll.IDLSetValue(_xll.IDLPara(1,\"STAGGKTO\",Database,,,,,,,,General!$B$6,$A28,,,,,General!$B$4,$A$12),_xll.IDLPara(2,,,$D28,,,ValidFrom,$F28),_xll.IDLPara(3,,,,,$C28)))","v":"STAGGKTO"}]
[{"$f":"KTO!A37","v":"90030"},{"$f":"KTO!B37","v":"Entnahme aus der Rücklage für eigene Anteile"},null,null,"12.2012",null,{"$f":"IF(TRUE,\"STAGGKTO\",_xll.IDLSetValue(_xll.IDLPara(1,\"STAGGKTO\",Database,,,,,,,,General!$B$6,$A29,,,,,General!$B$4,$A$12),_xll.IDLPara(2,,,$D29,,,ValidFrom,$F29),_xll.IDLPara(3,,,,,$C29)))","v":"STAGGKTO"}]
[{"$f":"KTO!A38","v":"90031"},{"$f":"KTO!B38","v":"Einstellung in die Rücklage für eigene Anteile"},null,null,"12.2012",null,{"$f":"IF(TRUE,\"STAGGKTO\",_xll.IDLSetValue(_xll.IDLPara(1,\"STAGGKTO\",Database,,,,,,,,General!$B$6,$A30,,,,,General!$B$4,$A$12),_xll.IDLPara(2,,,$D30,,,ValidFrom,$F30),_xll.IDLPara(3,,,,,$C30)))","v":"STAGGKTO"}]
[{"$f":"KTO!A39","v":"90050"},{"$f":"KTO!B39","v":"Entnahme aus den anderen Gewinnrücklagen"},null,null,"12.2012",null,{"$f":"IF(TRUE,\"STAGGKTO\",_xll.IDLSetValue(_xll.IDLPara(1,\"STAGGKTO\",Database,,,,,,,,General!$B$6,$A31,,,,,General!$B$4,$A$12),_xll.IDLPara(2,,,$D31,,,ValidFrom,$F31),_xll.IDLPara(3,,,,,$C31)))","v":"STAGGKTO"}]
[{"$f":"KTO!A40","v":"90051"},{"$f":"KTO!B40","v":"Einstellung in die anderen Gewinnrücklagen"},null,null,"12.2012",null,{"$f":"IF(TRUE,\"STAGGKTO\",_xll.IDLSetValue(_xll.IDLPara(1,\"STAGGKTO\",Database,,,,,,,,General!$B$6,$A32,,,,,General!$B$4,$A$12),_xll.IDLPara(2,,,$D32,,,ValidFrom,$F32),_xll.IDLPara(3,,,,,$C32)))","v":"STAGGKTO"}]
[{"$f":"POS!A8","v":"EK060"},{"$f":"POS!B8","v":"Mutterunternehmen - Kumul. übriges Konzernerg. Währungsumrechnung"}]
[{"$f":"KTO!A20","v":"3500K"},{"$f":"KTO!B20","v":"Ausgleichsposten Währungsumrechnung Bilanz (KW)"},null,null,{"$f":"ValidFrom","v":"12.2012"},null,{"$f":"IF(TRUE,\"STAGGKTO\",_xll.IDLSetValue(_xll.IDLPara(1,\"STAGGKTO\",Database,,,,,,,,General!$B$6,$A34,,,,,General!$B$4,$A$33),_xll.IDLPara(2,,,$D34,,,ValidFrom,$F34),_xll.IDLPara(3,,,,,$C34)))","v":"STAGGKTO"}]
[{"$f":"KTO!A21","v":"3501K"},{"$f":"KTO!B21","v":"Ausgleichsposten Währungsumrechnung Bilanz (PW)"},null,null,"12.2012",null,{"$f":"IF(TRUE,\"STAGGKTO\",_xll.IDLSetValue(_xll.IDLPara(1,\"STAGGKTO\",Database,,,,,,,,General!$B$6,$A35,,,,,General!$B$4,$A$33),_xll.IDLPara(2,,,$D35,,,ValidFrom,$F35),_xll.IDLPara(3,,,,,$C35)))","v":"STAGGKTO"}]
[{"$f":"KTO!A22","v":"3502K"},{"$f":"KTO!B22","v":"Ausgleichsposten Währungsumrechnung GuV (KW)"},null,null,"12.2012",null,{"$f":"IF(TRUE,\"STAGGKTO\",_xll.IDLSetValue(_xll.IDLPara(1,\"STAGGKTO\",Database,,,,,,,,General!$B$6,$A36,,,,,General!$B$4,$A$33),_xll.IDLPara(2,,,$D36,,,ValidFrom,$F36),_xll.IDLPara(3,,,,,$C36)))","v":"STAGGKTO"}]
[{"$f":"KTO!A23","v":"3503K"},{"$f":"KTO!B23","v":"Ausgleichsposten Währungsumrechnung GuV (PW)"},null,null,"12.2012",null,{"$f":"IF(TRUE,\"STAGGKTO\",_xll.IDLSetValue(_xll.IDLPara(1,\"STAGGKTO\",Database,,,,,,,,General!$B$6,$A37,,,,,General!$B$4,$A$33),_xll.IDLPara(2,,,$D37,,,ValidFrom,$F37),_xll.IDLPara(3,,,,,$C37)))","v":"STAGGKTO"}]
[{"$f":"KTO!A24","v":"3504K"},{"$f":"KTO!B24","v":"EF Währungseffekte Eigenkapital"},null,null,"12.2012",null,{"$f":"IF(TRUE,\"STAGGKTO\",_xll.IDLSetValue(_xll.IDLPara(1,\"STAGGKTO\",Database,,,,,,,,General!$B$6,$A38,,,,,General!$B$4,$A$33),_xll.IDLPara(2,,,$D38,,,ValidFrom,$F38),_xll.IDLPara(3,,,,,$C38)))","v":"STAGGKTO"}]
[{"$f":"KTO!A25","v":"3505K"},{"$f":"KTO!B25","v":"EF Währungseffekte Goodwill"},null,null,"12.2012",null,{"$f":"IF(TRUE,\"STAGGKTO\",_xll.IDLSetValue(_xll.IDLPara(1,\"STAGGKTO\",Database,,,,,,,,General!$B$6,$A39,,,,,General!$B$4,$A$33),_xll.IDLPara(2,,,$D39,,,ValidFrom,$F39),_xll.IDLPara(3,,,,,$C39)))","v":"STAGGKTO"}]
[{"$f":"KTO!A26","v":"3506K"},{"$f":"KTO!B26","v":"EF Währungseffekte Jahresergebnis"},null,null,"12.2012",null,{"$f":"IF(TRUE,\"STAGGKTO\",_xll.IDLSetValue(_xll.IDLPara(1,\"STAGGKTO\",Database,,,,,,,,General!$B$6,$A40,,,,,General!$B$4,$A$33),_xll.IDLPara(2,,,$D40,,,ValidFrom,$F40),_xll.IDLPara(3,,,,,$C40)))","v":"STAGGKTO"}]
[{"$f":"POS!A9","v":"EK070"},{"$f":"POS!B9","v":"Mutterunternehmen - Kumul. übriges Konzernerg. übrige neutr. Veränder."}]
[{"$f":"KTO!A27","v":"35500"},{"$f":"KTO!B27","v":"Neubewertungsrücklage"},null,null,{"$f":"ValidFrom","v":"12.2012"},null,{"$f":"IF(TRUE,\"STAGGKTO\",_xll.IDLSetValue(_xll.IDLPara(1,\"STAGGKTO\",Database,,,,,,,,General!$B$6,$A42,,,,,General!$B$4,$A$41),_xll.IDLPara(2,,,$D42,,,ValidFrom,$F42),_xll.IDLPara(3,,,,,$C42)))","v":"STAGGKTO"}]
[{"$f":"POS!A13","v":"EK110"},{"$f":"POS!B13","v":"Minderheitsges. - Minderheitenkapital"}]
[{"$f":"KTO!A28","v":"3600K"},{"$f":"KTO!B28","v":"Fremdanteile am Kapital und am Gewinnvortrag"},null,null,{"$f":"ValidFrom","v":"12.2012"},null,{"$f":"IF(TRUE,\"STAGGKTO\",_xll.IDLSetValue(_xll.IDLPara(1,\"STAGGKTO\",Database,,,,,,,,General!$B$6,$A44,,,,,General!$B$4,$A$43),_xll.IDLPara(2,,,$D44,,,ValidFrom,$F44),_xll.IDLPara(3,,,,,$C44)))","v":"STAGGKTO"}]
[{"$f":"KTO!A29","v":"3610K"},{"$f":"KTO!B29","v":"Fremdanteile am Jahresüberschuss"},null,null,{"$f":"ValidFrom","v":"12.2012"},null,{"$f":"IF(TRUE,\"STAGGKTO\",_xll.IDLSetValue(_xll.IDLPara(1,\"STAGGKTO\",Database,,,,,,,,General!$B$6,$A45,,,,,General!$B$4,$A$43),_xll.IDLPara(2,,,$D45,,,ValidFrom,$F45),_xll.IDLPara(3,,,,,$C45)))","v":"STAGGKTO"}]
[{"$f":"POS!A14","v":"EK120"},{"$f":"POS!B14","v":"Minderheitsges. - Kumul. übriges Konzernerg. Währungsumrechnung"}]
[{"$f":"KTO!A30","v":"3620K"},{"$f":"KTO!B30","v":"Fremdanteile am Ausgleichsposten Währungsumrechnung Bilanz"},null,null,{"$f":"ValidFrom","v":"12.2012"},null,{"$f":"IF(TRUE,\"STAGGKTO\",_xll.IDLSetValue(_xll.IDLPara(1,\"STAGGKTO\",Database,,,,,,,,General!$B$6,$A47,,,,,General!$B$4,$A$46),_xll.IDLPara(2,,,$D47,,,ValidFrom,$F47),_xll.IDLPara(3,,,,,$C47)))","v":"STAGGKTO"}]
[{"$f":"KTO!A31","v":"3630K"},{"$f":"KTO!B31","v":"Fremdanteile am Ausgleichsposten Währungsumrechnung GuV"},null,null,{"$f":"ValidFrom","v":"12.2012"},null,{"$f":"IF(TRUE,\"STAGGKTO\",_xll.IDLSetValue(_xll.IDLPara(1,\"STAGGKTO\",Database,,,,,,,,General!$B$6,$A48,,,,,General!$B$4,$A$46),_xll.IDLPara(2,,,$D48,,,ValidFrom,$F48),_xll.IDLPara(3,,,,,$C48)))","v":"STAGGKTO"}]
[{"$f":"POS!A15","v":"EK130"},{"$f":"POS!B15","v":"Minderheitsges. - Kumul. übriges Konzernerg. übrige neutr. Veränderung"}]
[{"$f":"KTO!A32","v":"3650K"},{"$f":"KTO!B32","v":"Fremdanteile an der Neubewertungsrücklage"},null,null,{"$f":"ValidFrom","v":"12.2012"},null,{"$f":"IF(TRUE,\"STAGGKTO\",_xll.IDLSetValue(_xll.IDLPara(1,\"STAGGKTO\",Database,,,,,,,,General!$B$6,$A50,,,,,General!$B$4,$A$49),_xll.IDLPara(2,,,$D50,,,ValidFrom,$F50),_xll.IDLPara(3,,,,,$C50)))","v":"STAGGKTO"}]

{"sheet":"RID","index":6,"n_rows":4,"n_cols":13,"rows_kept":4,"merged":[[0,6,0,7],[0,8,0,9],[0,10,0,11],[0,12,2,12],[1,6,1,7]]}
["Report","Bezeichnung","Kurztext","Report-","Spie-","Ref","Spalten",null,"Kennz.",null,"Gültig",null,"Bezug IDL.XLSLINK"]
["ID","","","Typ","gel","Rep","Option",null,"FRM","Def","ab","bis",""]
["","","","","","ID","Ges","Kon","erf","Rep"]
[{"$f":"[1]General!B10","v":"EK"},"Eigenkapitalspiegel","EigKapital","D",{"$f":"[1]General!B12","v":"K"},{"$nulls":5},{"$f":"ValidFrom","v":"12.2012"},null,{"$f":"IF(TRUE,\"STRID\",_xll.IDLSetValue(_xll.IDLPara(1,\"STRID\",Database,,,,,,,,,,,,,,,,$L4,ValidFrom,Language1,,,,,$C4,$B4),_xll.IDLPara(2,,$F4,General!B10,$G4,$D4,$H4,$I4,$J4,General!$B$8)))","v":"STRID"}]

{"sheet":"REPZEI","index":7,"n_rows":18,"n_cols":15,"rows_kept":18,"merged":[[0,9,0,11],[0,12,0,13],[0,14,2,14],[2,9,2,9],[2,10,2,10],[2,11,2,11],[2,12,2,12],[2,13,2,13]]}
["Zeile","Pos","Position","Positions-Bezeichnung","Zeil","Wert","Ex","In","Sp","Druck","Druck","Druck","Zugeordn.","Zugeordn.","Bezug IDL.XLSLINK"]
[null,"Plan",null,null,"Typ","Knz"]
["",null,"","","","","","","","V","N","U","Plan","Position",""]
[10,{"$f":"POP!$A$3","v":"EKPOS"},{"$f":"POS!A3","v":"EK010"},{"$f":"POS!B3","v":"Mutterunternehmen - Gezeichnetes Kapital"},"P","1",null,"01",{"$nulls":6},{"$f":"IF(TRUE,\"STREPZEI\",_xll.IDLSetValue(_xll.IDLPara(1,\"STREPZEI\",Database,,,,,,,,,,,,,,General!$B$4,C4),_xll.IDLPara(2,,,,,,,M4,N4,General!$B$8,A4,,,J4,K4,L4,H4,G4,I4,F4,E4)))","v":"STREPZEI"}]
[20,{"$f":"POP!$A$3","v":"EKPOS"},{"$f":"POS!A4","v":"EK020"},{"$f":"POS!B4","v":"Mutterunternehmen - Nicht eingeforderte ausstehende Einlage"},"P","1",null,"01",{"$nulls":6},{"$f":"IF(TRUE,\"STREPZEI\",_xll.IDLSetValue(_xll.IDLPara(1,\"STREPZEI\",Database,,,,,,,,,,,,,,General!$B$4,C5),_xll.IDLPara(2,,,,,,,M5,N5,General!$B$8,A5,,,J5,K5,L5,H5,G5,I5,F5,E5)))","v":"STREPZEI"}]
[30,{"$f":"POP!$A$3","v":"EKPOS"},{"$f":"POS!A5","v":"EK030"},{"$f":"POS!B5","v":"Mutterunternehmen - Eigene Anteile"},"P","1",null,"01",{"$nulls":6},{"$f":"IF(TRUE,\"STREPZEI\",_xll.IDLSetValue(_xll.IDLPara(1,\"STREPZEI\",Database,,,,,,,,,,,,,,General!$B$4,C6),_xll.IDLPara(2,,,,,,,M6,N6,General!$B$8,A6,,,J6,K6,L6,H6,G6,I6,F6,E6)))","v":"STREPZEI"}]
[40,{"$f":"POP!$A$3","v":"EKPOS"},{"$f":"POS!A6","v":"EK040"},{"$f":"POS!B6","v":"Mutterunternehmen - Kapitalrücklage"},"P","1",null,"01",{"$nulls":6},{"$f":"IF(TRUE,\"STREPZEI\",_xll.IDLSetValue(_xll.IDLPara(1,\"STREPZEI\",Database,,,,,,,,,,,,,,General!$B$4,C7),_xll.IDLPara(2,,,,,,,M7,N7,General!$B$8,A7,,,J7,K7,L7,H7,G7,I7,F7,E7)))","v":"STREPZEI"}]
[50,{"$f":"POP!$A$3","v":"EKPOS"},{"$f":"POS!A7","v":"EK050"},{"$f":"POS!B7","v":"Mutterunternehmen - Erwirtschaftetes Eigenkapital"},"P","1",null,"01",{"$nulls":6},{"$f":"IF(TRUE,\"STREPZEI\",_xll.IDLSetValue(_xll.IDLPara(1,\"STREPZEI\",Database,,,,,,,,,,,,,,General!$B$4,C8),_xll.IDLPara(2,,,,,,,M8,N8,General!$B$8,A8,,,J8,K8,L8,H8,G8,I8,F8,E8)))","v":"STREPZEI"}]
[60,{"$f":"POP!$A$3","v":"EKPOS"},{"$f":"POS!A8","v":"EK060"},{"$f":"POS!B8","v":"Mutterunternehmen - Kumul. übriges Konzernerg. Währungsumrechnung"},"P","1",null,"01",{"$nulls":6},{"$f":"IF(TRUE,\"STREPZEI\",_xll.IDLSetValue(_xll.IDLPara(1,\"STREPZEI\",Database,,,,,,,,,,,,,,General!$B$4,C9),_xll.IDLPara(2,,,,,,,M9,N9,General!$B$8,A9,,,J9,K9,L9,H9,G9,I9,F9,E9)))","v":"STREPZEI"}]
[70,{"$f":"POP!$A$3","v":"EKPOS"},{"$f":"POS!A9","v":"EK070"},{"$f":"POS!B9","v":"Mutterunternehmen - Kumul. übriges Konzernerg. übrige neutr. Veränder."},"P","1",null,"01",{"$nulls":6},{"$f":"IF(TRUE,\"STREPZEI\",_xll.IDLSetValue(_xll.IDLPara(1,\"STREPZEI\",Database,,,,,,,,,,,,,,General!$B$4,C10),_xll.IDLPara(2,,,,,,,M10,N10,General!$B$8,A10,,,J10,K10,L10,H10,G10,I10,F10,E10)))","v":"STREPZEI"}]
[80,{"$f":"POP!$A$3","v":"EKPOS"},{"$f":"POS!A10","v":"EK080"},{"$f":"POS!B10","v":"Mutterunternehmen - Eigenkapital gem. Konzernbilanz"},"P","1",null,"01",{"$nulls":6},{"$f":"IF(TRUE,\"STREPZEI\",_xll.IDLSetValue(_xll.IDLPara(1,\"STREPZEI\",Database,,,,,,,,,,,,,,General!$B$4,C11),_xll.IDLPara(2,,,,,,,M11,N11,General!$B$8,A11,,,J11,K11,L11,H11,G11,I11,F11,E11)))","v":"STREPZEI"}]
[90,{"$f":"POP!$A$3","v":"EKPOS"},{"$f":"POS!A11","v":"EK090"},{"$f":"POS!B11","v":"Mutterunternehmen - Übrige eigene Anteile"},"P","1",null,"01",{"$nulls":6},{"$f":"IF(TRUE,\"STREPZEI\",_xll.IDLSetValue(_xll.IDLPara(1,\"STREPZEI\",Database,,,,,,,,,,,,,,General!$B$4,C12),_xll.IDLPara(2,,,,,,,M12,N12,General!$B$8,A12,,,J12,K12,L12,H12,G12,I12,F12,E12)))","v":"STREPZEI"}]
[100,{"$f":"POP!$A$3","v":"EKPOS"},{"$f":"POS!A12","v":"EK100"},{"$f":"POS!B12","v":"Mutterunternehmen - Eigenkapital"},"S","0","01","02",{"$nulls":6},{"$f":"IF(TRUE,\"STREPZEI\",_xll.IDLSetValue(_xll.IDLPara(1,\"STREPZEI\",Database,,,,,,,,,,,,,,General!$B$4,C13),_xll.IDLPara(2,,,,,,,M13,N13,General!$B$8,A13,,,J13,K13,L13,H13,G13,I13,F13,E13)))","v":"STREPZEI"}]
[110,{"$f":"POP!$A$3","v":"EKPOS"},{"$f":"POS!A13","v":"EK110"},{"$f":"POS!B13","v":"Minderheitsges. - Minderheitenkapital"},"P","1",null,"01",{"$nulls":6},{"$f":"IF(TRUE,\"STREPZEI\",_xll.IDLSetValue(_xll.IDLPara(1,\"STREPZEI\",Database,,,,,,,,,,,,,,General!$B$4,C14),_xll.IDLPara(2,,,,,,,M14,N14,General!$B$8,A14,,,J14,K14,L14,H14,G14,I14,F14,E14)))","v":"STREPZEI"}]
[120,{"$f":"POP!$A$3","v":"EKPOS"},{"$f":"POS!A14","v":"EK120"},{"$f":"POS!B14","v":"Minderheitsges. - Kumul. übriges Konzernerg. Währungsumrechnung"},"P","1",null,"01",{"$nulls":6},{"$f":"IF(TRUE,\"STREPZEI\",_xll.IDLSetValue(_xll.IDLPara(1,\"STREPZEI\",Database,,,,,,,,,,,,,,General!$B$4,C15),_xll.IDLPara(2,,,,,,,M15,N15,General!$B$8,A15,,,J15,K15,L15,H15,G15,I15,F15,E15)))","v":"STREPZEI"}]
[130,{"$f":"POP!$A$3","v":"EKPOS"},{"$f":"POS!A15","v":"EK130"},{"$f":"POS!B15","v":"Minderheitsges. - Kumul. übriges Konzernerg. übrige neutr. Veränderung"},"P","1",null,"01",{"$nulls":6},{"$f":"IF(TRUE,\"STREPZEI\",_xll.IDLSetValue(_xll.IDLPara(1,\"STREPZEI\",Database,,,,,,,,,,,,,,General!$B$4,C16),_xll.IDLPara(2,,,,,,,M16,N16,General!$B$8,A16,,,J16,K16,L16,H16,G16,I16,F16,E16)))","v":"STREPZEI"}]
[140,{"$f":"POP!$A$3","v":"EKPOS"},{"$f":"POS!A16","v":"EK140"},{"$f":"POS!B16","v":"Minderheitsges. - Eigenkapital"},"S","0","01","02",{"$nulls":6},{"$f":"IF(TRUE,\"STREPZEI\",_xll.IDLSetValue(_xll.IDLPara(1,\"STREPZEI\",Database,,,,,,,,,,,,,,General!$B$4,C17),_xll.IDLPara(2,,,,,,,M17,N17,General!$B$8,A17,,,J17,K17,L17,H17,G17,I17,F17,E17)))","v":"STREPZEI"}]
[150,{"$f":"POP!$A$3","v":"EKPOS"},{"$f":"POS!A17","v":"EK150"},{"$f":"POS!B17","v":"Gesamt"},"S","0","02",{"$nulls":7},{"$f":"IF(TRUE,\"STREPZEI\",_xll.IDLSetValue(_xll.IDLPara(1,\"STREPZEI\",Database,,,,,,,,,,,,,,General!$B$4,C18),_xll.IDLPara(2,,,,,,,M18,N18,General!$B$8,A18,,,J18,K18,L18,H18,G18,I18,F18,E18)))","v":"STREPZEI"}]